{"text_format":"3","workbook":"xlsx","n_sheets":22,"sheets":["Contato","Dashboard","Edital","Ciclo","Grade","Horas","Exercícios","Simulados","Videoaulas","Leitura","ConcursosPrevistos","ConcursosRealizados","Financeiro","Rel_Exer","Rel_Sim","Rel_Horas","Rel_Fin","Configurações","Dados","1","2","3"],"not_rendered":{"charts":11,"images":22,"macros":1,"defined_names":14,"comments":6},"read":"whole","date_system":"1900"}

{"sheet":"Contato","index":0,"n_rows":21,"n_cols":2,"rows_kept":21}
{"$rows_empty":20}
[null,"ícones: designed by  Flat Icons, Freepik, Flat Icons from Flaticon\n\n"]

{"sheet":"Dashboard","index":1,"n_rows":50,"n_cols":21,"rows_kept":50,"merged":[[9,1,9,7],[9,9,9,15],[10,1,10,7],[10,9,10,15],[11,1,11,7],[11,9,11,15],[12,1,12,7],[12,9,12,15],[13,1,13,7],[13,9,13,15],[14,1,14,7],[14,9,14,15],[15,1,15,7],[15,9,15,15],[16,1,16,7],[16,9,16,15],[17,1,17,7],[17,9,17,15],[18,1,18,7],[18,9,18,15],[19,1,19,7],[19,9,19,15]]}
[]
[]
[null,{"$f":"\"Faltam \"&E49&\" dias (\"&E50&\" semanas)\"&\" para o concurso\"","v":"Faltam 54 dias (7 semanas) para o concurso"}]
[]
[{"$nulls":17},"Mês","Meta","Realizado"]
[{"$nulls":17},{"$f":"MONTH(NOW())","v":12},{"$f":"VLOOKUP(R6,Dados!W6:Y17,2,FALSE)","v":5.833333333333333},{"$f":"VLOOKUP(R6,Dados!W6:Y17,3,FALSE)","v":0}]
[{"$nulls":17},{"$f":"UPPER(TEXT(R6,\"MMMM\"))","v":"JANEIRO"},{"$f":"S6","v":5.833333333333333},{"$f":"T6","v":0},{"$f":"T7/S7","v":{"v":0,"d":"0%"}}]
[]
{"$rows_left_out":14}
{"sheet":"Edital","index":2,"n_rows":35,"n_cols":17,"rows_kept":35,"merged":[[6,1,6,2],[6,3,6,5],[6,8,6,9],[6,11,8,11],[8,1,8,2],[8,3,8,5],[8,8,8,9],[10,1,10,2],[10,3,10,5],[10,8,10,9],[13,1,13,3],[13,5,13,6],[14,2,14,3],[14,5,14,6],[15,2,15,3],[15,5,15,6],[16,2,16,3],[16,5,16,6],[17,2,17,3],[17,5,17,6],[18,2,18,3],[18,5,18,6],[19,2,19,3],[19,5,19,6],[20,2,20,3],[20,5,20,6],[21,2,21,3],[21,5,21,6],[22,2,22,3],[22,5,22,6],[23,2,23,3],[23,5,23,6],[24,2,24,3],[24,5,24,6],[25,2,25,3],[25,5,25,6],[26,2,26,3],[26,5,26,6],[27,2,27,3],[27,5,27,6],[28,2,28,3],[28,5,28,6],[29,2,29,3],[29,5,29,6],[30,2,30,3],[30,5,30,6],[31,2,31,3],[31,5,31,6],[32,2,32,3],[32,5,32,6],[33,2,33,3],[33,5,33,6]]}
[]
[]
[]
[]
[null,"Informações sobre o concurso que você irá prestar"]
[]
[null,"Concurso",null,"POLÍCIA RODOVIÁRIA FEDERAL",{"$nulls":3},"Início estudos","2018-12-06",null,null,{"$f":"Dashboard!D49","v":54},{"$nulls":4},{"$f":"Dados!T15","v":25}]
[]
{"$rows_left_out":28}
{"sheet":"Ciclo","index":3,"n_rows":21,"n_cols":15,"rows_kept":21,"merged":[[4,1,4,4],[4,7,4,10],[5,1,5,2],[5,7,5,8]]}
[]
[]
[]
[]
[null,"Ciclo 1",{"$nulls":5},"Ciclo 2",{"$nulls":4},{"$f":"COUNTA(E7:E21)","v":2},{"$f":"COUNTIF(E7:E21,\"Sim\")","v":2},{"$f":"N5&\"/\"&M5","v":"2/2"}]
[null,"Matéria",null,"Horas","Estudou?",null,null,"Matéria",null,"Horas","Estudou?",null,{"$f":"SUM(D7:D21)","v":0.14583333333333331},{"$f":"M6","v":0.14583333333333331}]
[null,1,"DIREITO ADMINISTRATIVO","01:30:00","Sim",{"$f":"D7","v":0.0625},null,1,{"$nulls":3},{"$f":"J7","v":0},{"$f":"SUMIF(E7:E21,\"Sim\",D7:D21)","v":0.14583333333333331},{"$f":"M7","v":0.14583333333333331},{"$f":"N7/N6","v":{"v":1,"d":"100%"}}]
[null,2,"DIREITO PENAL","02:00:00","Sim",{"$f":"D8","v":0.08333333333333333},null,2,{"$nulls":3},{"$f":"J8","v":0},{"$f":"M6-M7","v":0},{"$f":"M8","v":0}]
{"$rows_left_out":14}
{"sheet":"Grade","index":4,"n_rows":23,"n_cols":9,"rows_kept":23,"merged":[[7,10,8,10],[9,10,10,10]]}
[]
[]
[{"$nulls":8},"Dica"]
[]
[null,"Horário","Segunda","Terça","Quarta","Quinta","Sexta","Sábado","Domingo"]
[null,"06h - 07h"]
[null,"07h - 08h"]
[null,"08h - 09h"]
{"$rows_left_out":16}
{"sheet":"Horas","index":5,"n_rows":11,"n_cols":12,"rows_kept":11}
[]
[{"$nulls":6},"►","Hoje",{"$f":"TODAY()","v":"2018-12-11"},{"$f":"IFERROR(SUMIFS(Tabela2[Horas],Tabela2[Data],\"=\"&I2),\"\")","v":0}]
[{"$nulls":6},"II",null,{"$f":"I2-WEEKDAY(I2,2)+1","v":"2018-12-10"},{"$f":"SUMIFS(Tabela2[Horas],Tabela2[Data],\">=\"&I4,Tabela2[Data],\"<=\"&I6)","v":0}]
[{"$nulls":8},{"$f":"I3","v":"2018-12-10"},null,null,{"$f":"DATE(YEAR(I2),MONTH(I2)+1,0)","v":"2018-12-31"}]
[{"$nulls":7},"Ult.dia.sema",{"$f":"I4+6","v":"2018-12-16"}]
[{"$nulls":8},{"$f":"I5","v":"2018-12-16"}]
[]
[]
{"$rows_left_out":4}
{"sheet":"Exercícios","index":6,"n_rows":12,"n_cols":10,"rows_kept":12,"merged":[[5,4,5,5]]}
[]
[]
[]
[{"$nulls":8},{"$f":"G6","v":{"v":0.65,"d":"65%"}}]
[]
[{"$nulls":4},"Marcar assuntos que eu acertar menos que:",null,{"v":0.65,"d":"65%"},null,{"$f":"SUBTOTAL(9,Tabela5[Questões])","v":74}]
[{"$nulls":8},{"$f":"SUBTOTAL(9,Tabela5[Acertos])","v":54},{"$f":"I6-I7","v":20}]
[]
{"$rows_left_out":5}
{"sheet":"Simulados","index":7,"n_rows":37,"n_cols":122,"rows_kept":37,"merged":[[4,3,4,7],[4,9,4,13],[4,15,4,19],[4,21,4,25],[4,27,4,31],[4,33,4,37],[4,39,4,43],[4,45,4,49],[4,51,4,55],[4,57,4,61],[4,63,4,67],[4,69,4,73],[4,75,4,79],[4,81,4,85],[4,87,4,91],[4,93,4,97],[4,99,4,103],[4,105,4,109],[4,111,4,115],[4,117,4,121],[5,3,5,4],[5,5,5,7],[5,9,5,10],[5,11,5,13],[5,15,5,16],[5,17,5,19],[5,21,5,22],[5,23,5,25],[5,27,5,28],[5,29,5,31],[5,33,5,34],[5,35,5,37],[5,39,5,40],[5,41,5,43],[5,45,5,46],[5,47,5,49],[5,51,5,52],[5,53,5,55],[5,57,5,58],[5,59,5,61],[5,63,5,64],[5,65,5,67],[5,69,5,70],[5,71,5,73],[5,75,5,76],[5,77,5,79],[5,81,5,82],[5,83,5,85],[5,87,5,88],[5,89,5,91],[5,93,5,94],[5,95,5,97],[5,99,5,100],[5,101,5,103],[5,105,5,106],[5,107,5,109],[5,111,5,112],[5,113,5,115],[5,117,5,118],[5,119,5,121],[6,3,6,4],[6,5,6,7],[6,9,6,10],[6,11,6,13],[6,15,6,16],[6,17,6,19],[6,21,6,22],[6,23,6,25],[6,27,6,28],[6,29,6,31],[6,33,6,34],[6,35,6,37],[6,39,6,40],[6,41,6,43],[6,45,6,46],[6,47,6,49],[6,51,6,52],[6,53,6,55],[6,57,6,58],[6,59,6,61],[6,63,6,64],[6,65,6,67],[6,69,6,70],[6,71,6,73],[6,75,6,76],[6,77,6,79],[6,81,6,82],[6,83,6,85],[6,87,6,88],[6,89,6,91],[6,93,6,94],[6,95,6,97],[6,99,6,100],[6,101,6,103],[6,105,6,106],[6,107,6,109],[6,111,6,112],[6,113,6,115],[6,117,6,118],[6,119,6,121],[7,3,7,4],[7,5,7,7],[7,9,7,10],[7,11,7,13],[7,15,7,16],[7,17,7,19],[7,21,7,22],[7,23,7,25],[7,27,7,28],[7,29,7,31],[7,33,7,34],[7,35,7,37],[7,39,7,40],[7,41,7,43],[7,45,7,46],[7,47,7,49],[7,51,7,52],[7,53,7,55],[7,57,7,58],[7,59,7,61],[7,63,7,64],[7,65,7,67],[7,69,7,70],[7,71,7,73],[7,75,7,76],[7,77,7,79],[7,81,7,82],[7,83,7,85],[7,87,7,88],[7,89,7,91],[7,93,7,94],[7,95,7,97],[7,99,7,100],[7,101,7,103],[7,105,7,106],[7,107,7,109],[7,111,7,112],[7,113,7,115],[7,117,7,118],[7,119,7,121],[8,3,8,4],[8,5,8,7],[8,9,8,10],[8,11,8,13],[8,15,8,16],[8,17,8,19],[8,21,8,22],[8,23,8,25],[8,27,8,28],[8,29,8,31],[8,33,8,34],[8,35,8,37],[8,39,8,40],[8,41,8,43],[8,45,8,46],[8,47,8,49],[8,51,8,52],[8,53,8,55],[8,57,8,58],[8,59,8,61],[8,63,8,64],[8,65,8,67],[8,69,8,70],[8,71,8,73],[8,75,8,76],[8,77,8,79],[8,81,8,82],[8,83,8,85],[8,87,8,88],[8,89,8,91],[8,93,8,94],[8,95,8,97],[8,99,8,100],[8,101,8,103],[8,105,8,106],[8,107,8,109],[8,111,8,112],[8,113,8,115],[8,117,8,118],[8,119,8,121]]}
[]
[]
[]
[]
[null,"Legenda",null,"SIMULADO 1",{"$nulls":5},"SIMULADO 2",{"$nulls":5},"SIMULADO 3",{"$nulls":5},"SIMULADO 4",{"$nulls":5},"SIMULADO 5",{"$nulls":5},"SIMULADO 6",{"$nulls":5},"SIMULADO 7",{"$nulls":5},"SIMULADO 8",{"$nulls":5},"SIMULADO 9",{"$nulls":5},"SIMULADO 10",{"$nulls":5},"SIMULADO 11",{"$nulls":5},"SIMULADO 12",{"$nulls":5},"SIMULADO 13",{"$nulls":5},"SIMULADO 14",{"$nulls":5},"SIMULADO 15",{"$nulls":5},"SIMULADO 16",{"$nulls":5},"SIMULADO 17",{"$nulls":5},"SIMULADO 18",{"$nulls":5},"SIMULADO 19",{"$nulls":5},"SIMULADO 20"]
[null,"Q = Número de questões",null,"Data",null,"2018-09-20",{"$nulls":3},"Data",{"$nulls":5},"Data",{"$nulls":5},"Data",{"$nulls":5},"Data",{"$nulls":5},"Data",{"$nulls":5},"Data",{"$nulls":5},"Data",{"$nulls":5},"Data",{"$nulls":5},"Data",{"$nulls":5},"Data",{"$nulls":5},"Data",{"$nulls":5},"Data",{"$nulls":5},"Data",{"$nulls":5},"Data",{"$nulls":5},"Data",{"$nulls":5},"Data",{"$nulls":5},"Data",{"$nulls":5},"Data",{"$nulls":5},"Data"]
[null,"A = Acertos",null,"Banca",null,"VUNESP",{"$nulls":3},"Banca",{"$nulls":5},"Banca",{"$nulls":5},"Banca",{"$nulls":5},"Banca",{"$nulls":5},"Banca",{"$nulls":5},"Banca",{"$nulls":5},"Banca",{"$nulls":5},"Banca",{"$nulls":5},"Banca",{"$nulls":5},"Banca",{"$nulls":5},"Banca",{"$nulls":5},"Banca",{"$nulls":5},"Banca",{"$nulls":5},"Banca",{"$nulls":5},"Banca",{"$nulls":5},"Banca",{"$nulls":5},"Banca",{"$nulls":5},"Banca",{"$nulls":5},"Banca"]
[null,"B = Questões em branco",null,"NC",null,{"v":0.8,"d":"80%"},{"$nulls":3},"NC",{"$nulls":5},"NC",{"$nulls":5},"NC",{"$nulls":5},"NC",{"$nulls":5},"NC",{"$nulls":5},"NC",{"$nulls":5},"NC",{"$nulls":5},"NC",{"$nulls":5},"NC",{"$nulls":5},"NC",{"$nulls":5},"NC",{"$nulls":5},"NC",{"$nulls":5},"NC",{"$nulls":5},"NC",{"$nulls":5},"NC",{"$nulls":5},"NC",{"$nulls":5},"NC",{"$nulls":5},"NC",{"$nulls":5},"NC"]
{"$rows_left_out":30}
{"sheet":"Videoaulas","index":8,"n_rows":26,"n_cols":26,"rows_kept":26}
[]
[]
[]
[null,"Legenda","A = Videoaula assistida",{"$nulls":3},"P = Videoaula pendente"]
[]
[null,"Aula",{"$f":"Edital!E15","v":"PORT"},{"$f":"Edital!E16","v":"RLM"},{"$f":"Edital!E17","v":"INFO"},{"$f":"Edital!E18","v":0},{"$f":"Edital!E19","v":0},{"$f":"Edital!E20","v":0},{"$f":"Edital!E21","v":0},{"$f":"Edital!E22","v":0},{"$f":"Edital!E23","v":0},{"$f":"Edital!E24","v":0},{"$f":"Edital!E25","v":0},{"$f":"Edital!E26","v":0},{"$f":"Edital!E27","v":0},{"$f":"Edital!E28","v":0},{"$f":"Edital!E29","v":0},{"$f":"Edital!E30","v":0},{"$f":"Edital!E31","v":0},{"$f":"Edital!E32","v":0},{"$f":"Edital!E33","v":0},{"$f":"Edital!E34","v":0}]
[null,"Aula 01","Sim","Sim","Sim","Sim",{"$nulls":19},{"$f":"COUNTA(C7:V156)","v":36}]
[null,"Aula 02","Sim","Sim","Sim","Não",{"$nulls":19},{"$f":"COUNTIF(C7:V156,\"Sim\")","v":9}]
{"$rows_left_out":19}
{"sheet":"Leitura","index":9,"n_rows":224,"n_cols":7,"rows_kept":224}
[]
[]
[]
[]
[null,"Matérias","Descrição","Págs","Atual","Progresso","Observações"]
[null,"LÍNGUA PORTUGUESA","PDF ESTRATÉGIA CONCURSOS - AULA 03",180,120,{"$f":"IFERROR(Tabela3[[#This Row],[Atual]]/Tabela3[[#This Row],[Págs]],\"\")","v":{"v":0.6666666666666666,"d":"67%"}}]
[null,"RACIOCÍNIO LÓGICO MATEMÁTICO","LIVRO - SÉRGIO CARVALHO",120,120,{"$f":"IFERROR(Tabela3[[#This Row],[Atual]]/Tabela3[[#This Row],[Págs]],\"\")","v":{"v":1,"d":"100%"}}]
[{"$nulls":5},{"$f":"IFERROR(Tabela3[[#This Row],[Atual]]/Tabela3[[#This Row],[Págs]],\"\")","v":""}]
{"$rows_left_out":217}
{"sheet":"ConcursosPrevistos","index":10,"n_rows":8,"n_cols":7,"rows_kept":8}
[]
[]
[]
[]
[null,"Concurso","Área","Data prevista*","Banca prevista*","Probabilidade","Minhas anotações"]
[null,"TJSP","JUDICIÁRIO","2019","VUNESP","Alta"]
[null,"ICMS","FISCAL","2019","ESAF","Média"]
[null,"RFB","FISCAL","2019","ESAF","Baixa"]
{"$rows_left_out":1}
{"sheet":"ConcursosRealizados","index":11,"n_rows":57,"n_cols":10,"rows_kept":57}
[]
[]
[]
[{"$nulls":8},{"$f":"COUNTIF(F8:F10,\"Aprovado\")","v":2},{"$f":"I4&\"/\"&I5","v":"2/0"}]
[{"$nulls":8},{"$f":"COUNTIF(F8:F10,\"Reprovado\")","v":0}]
[]
[null,"Concurso","Data da prova","Banca","Anotações","Status"]
[null,"TJSP - ESCREVENTE","2018-03-20","VUNESP","AGUARDANDO NOMEAÇÃO","Aprovado",{"$f":"IF(F8=\"Aprovado\",\"2\",IF(F8=\"Reprovado\",\"1\",\"0\"))","v":"2"}]
{"$rows_left_out":50}
{"sheet":"Financeiro","index":12,"n_rows":10,"n_cols":10,"rows_kept":10}
[]
[]
[]
[]
[{"$nulls":9},{"$f":"SUBTOTAL(9,Tabela1[Subtotal])","v":{"v":4580,"d":"R$ 4,580.00"}}]
[]
[null,"Data","Descrição","Receitas","Despesas","Subtotal"]
[null,"2018-12-15","COMPRA ESTRATÉGIA CONCURSOS",null,{"v":1200,"d":"R$ 1,200.00"},{"$f":"Tabela1[[#This Row],[Receitas]]-Tabela1[[#This Row],[Despesas]]","v":{"v":-1200,"d":"-R$ 1,200.00"}}]
{"$rows_left_out":3}
{"sheet":"Rel_Exer","index":13,"n_rows":23,"n_cols":9,"rows_kept":23,"merged":[[21,2,21,6]]}
{"$rows_empty":21}
[null,"Selecione a matéria","LÍNGUA PORTUGUESA"]
[{"$nulls":8}," "]

{"sheet":"Rel_Sim","index":14,"n_rows":0,"n_cols":0,"rows_kept":0}

{"sheet":"Rel_Horas","index":15,"n_rows":46,"n_cols":19,"rows_kept":46,"merged":[[22,2,22,3]]}
{"$rows_empty":22}
[null,"Selecione o mês","Outubro"]
[]
[{"$nulls":7},"Matérias","Horas",{"$nulls":8},{"$f":"IF(C23=\"Janeiro\",1,IF(C23=\"Fevereiro\",2,IF(C23=\"Março\",3,IF(C23=\"Abril\",4,IF(C23=\"Maio\",5,IF(C23=\"Junho\",6,IF(C23=\"Julho\",7,IF(C23=\"Agosto\",8,IF(C23=\"Setembro\",9,IF(C23=\"Outubro\",10,IF(C23=\"Novembro\",11,IF(C23=\"Dezembro\",12))))))))))))","v":10},{"$f":"R25+1","v":11}]
[{"$nulls":7},{"$f":"Dados!B6","v":"LÍNGUA PORTUGUESA"},{"$f":"IFERROR(VLOOKUP(H26,Dados!$B$5:$N$25,$S$25,FALSE),\"\")","v":0}]
[{"$nulls":7},{"$f":"Dados!B7","v":"RACIOCÍNIO LÓGICO MATEMÁTICO"},{"$f":"IFERROR(VLOOKUP(H27,Dados!$B$5:$N$25,$S$25,FALSE),\"\")","v":0},{"$nulls":6},{"$f":"Edital!E15","v":"PORT"},null,null,{"$f":"SUMIF(Tabela5[],H26,Tabela5[Questões])","v":7}]
[{"$nulls":7},{"$f":"Dados!B8","v":"INFORMÁTICA"},{"$f":"IFERROR(VLOOKUP(H28,Dados!$B$5:$N$25,$S$25,FALSE),\"\")","v":0},{"$nulls":6},{"$f":"Edital!E16","v":"RLM"},null,null,{"$f":"SUMIF(Tabela5[],H27,Tabela5[Questões])","v":18}]
[{"$nulls":7},{"$f":"Dados!B9","v":0},{"$f":"IFERROR(VLOOKUP(H29,Dados!$B$5:$N$25,$S$25,FALSE),\"\")","v":0},{"$nulls":6},{"$f":"Edital!E17","v":"INFO"},null,null,{"$f":"SUMIF(Tabela5[],H28,Tabela5[Questões])","v":29}]
{"$rows_left_out":18}
{"sheet":"Rel_Fin","index":16,"n_rows":11,"n_cols":16,"rows_kept":11}
[]
[]
[]
[]
[]
[]
[null,null,1,2,3,4,5,6,7,8,9,10,11,12]
[null,"Fluxo de caixa","Janeiro","Fevereiro","Março","Abril","Maio","Junho","Julho","Agosto","Setembro","Outubro","Novembro","Dezembro"]
{"$rows_left_out":4}
{"sheet":"Configurações","index":17,"n_rows":34,"n_cols":14,"rows_kept":34,"merged":[[15,2,15,3],[15,6,15,7],[15,10,15,11],[16,2,16,3],[16,6,16,7],[16,10,16,11],[17,2,17,3],[17,6,17,7],[17,10,17,11],[18,2,18,3],[18,6,18,7],[18,10,18,11],[24,2,24,3],[25,2,25,3],[26,2,26,3],[27,2,27,3],[28,2,28,3],[29,2,29,3],[30,2,30,3],[31,2,31,3],[32,2,32,3],[33,2,33,3]]}
[]
[]
[]
[]
[null,"Horários disponíveis para estudar"]
[null,"Digite o tempo que você tem disponível para estudar em cada dia da semana."]
[]
[]
{"$rows_left_out":27}
{"sheet":"Dados","index":18,"n_rows":41,"n_cols":58,"rows_kept":41,"merged":[[3,51,3,52]]}
[null,"NÃO ALTERE !!!  DADOS IMPORTANTES"]
[]
[null,"Horas: Matérias x Meses",{"$nulls":14},"Cálculo horas disponíveis p/ estudo",{"$nulls":5},"Meta estudo x Realizado",{"$nulls":8},"Questões",{"$nulls":19},"Matéria"]
[{"$nulls":40},"Total resolvidas",{"$nulls":4},"MAIOR",null,null,"MENOR",null,null,"Mês",null,"Questões","Acertos","Erros","%Acerto","%Erro"]
[null,"Matéria x Mês",1,2,3,4,5,6,7,8,9,10,11,12,"Total Horas x Ano",null,"Data inicial dos estudos",{"$f":"Edital!I7","v":"2018-12-06"},{"$nulls":5},"Meta","Realizado",{"$nulls":6},"Mês","Mês","Questões resolvidas","Acertos","Erros","%Des","%Ace","%Erro",null,{"$f":"SUMIF(Tabela5[],AP5,Tabela5[Questões])","v":7},{"$f":"Edital!C15","v":"LÍNGUA PORTUGUESA"},null,1,{"$f":"LARGE($AO$5:$AO$24,1)","v":29},{"$f":"VLOOKUP(AS5,$AO$5:$AP$24,2,FALSE)","v":"INFORMÁTICA"},null,1,{"$f":"SMALL($AO$5:$AO$24,1)","v":0},{"$f":"VLOOKUP(AW5,$AO$5:$AP$24,2,)","v":0},null,"Jan",1,{"$f":"IFERROR(SUMPRODUCT((MONTH(Tabela5[Data])=BA5)*(Tabela5[Matéria]=Rel_Exer!$C$22)*(Tabela5[Questões])),\"\")","v":0},{"$f":"IFERROR(SUMPRODUCT((MONTH(Tabela5[Data])=BA5)*(Tabela5[Matéria]=Rel_Exer!$C$22)*(Tabela5[Acertos])),\"\")","v":0},{"$f":"BB5-BC5","v":0},{"$f":"IFERROR(BC5/BB5,\"\")","v":""},{"$f":"IFERROR(BD5/BB5,\"\")","v":""}]
[null,{"$f":"Edital!C15","v":"LÍNGUA PORTUGUESA"},{"$f":"IFERROR(SUMPRODUCT((MONTH(Tabela2[Data])=$C$5)*(Tabela2[Matéria]=B6)*Tabela2[Horas]),\"\")","v":0},{"$f":"IFERROR(SUMPRODUCT((MONTH(Tabela2[Data])=$D$5)*(Tabela2[Matéria]=B6)*Tabela2[Horas]),\"\")","v":0},{"$f":"IFERROR(SUMPRODUCT((MONTH(Tabela2[Data])=$E$5)*(Tabela2[Matéria]=B6)*Tabela2[Horas]),\"\")","v":0},{"$f":"IFERROR(SUMPRODUCT((MONTH(Tabela2[Data])=$F$5)*(Tabela2[Matéria]=B6)*Tabela2[Horas]),\"\")","v":0},{"$f":"IFERROR(SUMPRODUCT((MONTH(Tabela2[Data])=$G$5)*(Tabela2[Matéria]=B6)*Tabela2[Horas]),\"\")","v":0},{"$f":"IFERROR(SUMPRODUCT((MONTH(Tabela2[Data])=$H$5)*(Tabela2[Matéria]=B6)*Tabela2[Horas]),\"\")","v":0},{"$f":"IFERROR(SUMPRODUCT((MONTH(Tabela2[Data])=$I$5)*(Tabela2[Matéria]=B6)*Tabela2[Horas]),\"\")","v":0},{"$f":"IFERROR(SUMPRODUCT((MONTH(Tabela2[Data])=$J$5)*(Tabela2[Matéria]=B6)*Tabela2[Horas]),\"\")","v":0},{"$f":"IFERROR(SUMPRODUCT((MONTH(Tabela2[Data])=$K$5)*(Tabela2[Matéria]=B6)*Tabela2[Horas]),\"\")","v":0},{"$f":"IFERROR(SUMPRODUCT((MONTH(Tabela2[Data])=$L$5)*(Tabela2[Matéria]=B6)*Tabela2[Horas]),\"\")","v":0},{"$f":"IFERROR(SUMPRODUCT((MONTH(Tabela2[Data])=$M$5)*(Tabela2[Matéria]=B6)*Tabela2[Horas]),\"\")","v":0},{"$f":"IFERROR(SUMPRODUCT((MONTH(Tabela2[Data])=$N$5)*(Tabela2[Matéria]=B6)*Tabela2[Horas]),\"\")","v":0},null,null,"Data do concurso",{"$f":"Edital!I9","v":"2019-02-03"},{"$nulls":3},"Jan",1,{"$f":"Configurações!C16","v":4.166666666666667},{"$f":"C26","v":0},{"$nulls":6},"Jan",1,{"$f":"SUMPRODUCT((MONTH(Tabela5[Data])=AG6)*(Tabela5[Questões]))","v":0},{"$f":"SUMPRODUCT((MONTH(Tabela5[Data])=AG6)*(Tabela5[Acertos]))","v":0},{"$f":"AH6-AI6","v":0},{"$f":"IFERROR(AI6/AH6,\"\")","v":""},{"$f":"IFERROR(AI6/AH6,\"\")","v":""},{"$f":"IFERROR(AJ6/AH6,\"\")","v":""},null,{"$f":"SUMIF(Tabela5[],AP6,Tabela5[Questões])","v":18},{"$f":"Edital!C16","v":"RACIOCÍNIO LÓGICO MATEMÁTICO"},null,2,{"$f":"LARGE($AO$5:$AO$24,2)","v":18},{"$f":"VLOOKUP(AS6,$AO$5:$AP$24,2,FALSE)","v":"RACIOCÍNIO LÓGICO MATEMÁTICO"},null,2,{"$f":"SMALL($AO$5:$AO$24,2)","v":0},{"$f":"VLOOKUP(AW6,$AO$5:$AP$24,2,)","v":0},null,"Fev",2,{"$f":"IFERROR(SUMPRODUCT((MONTH(Tabela5[Data])=BA6)*(Tabela5[Matéria]=Rel_Exer!$C$22)*(Tabela5[Questões])),\"\")","v":0},{"$f":"IFERROR(SUMPRODUCT((MONTH(Tabela5[Data])=BA6)*(Tabela5[Matéria]=Rel_Exer!$C$22)*(Tabela5[Acertos])),\"\")","v":0},{"$f":"BB6-BC6","v":0},{"$f":"IFERROR(BC6/BB6,\"\")","v":""},{"$f":"IFERROR(BD6/BB6,\"\")","v":""}]
[null,{"$f":"Edital!C16","v":"RACIOCÍNIO LÓGICO MATEMÁTICO"},{"$f":"IFERROR(SUMPRODUCT((MONTH(Tabela2[Data])=$C$5)*(Tabela2[Matéria]=B7)*Tabela2[Horas]),\"\")","v":0},{"$f":"IFERROR(SUMPRODUCT((MONTH(Tabela2[Data])=$D$5)*(Tabela2[Matéria]=B7)*Tabela2[Horas]),\"\")","v":0},{"$f":"IFERROR(SUMPRODUCT((MONTH(Tabela2[Data])=$E$5)*(Tabela2[Matéria]=B7)*Tabela2[Horas]),\"\")","v":0},{"$f":"IFERROR(SUMPRODUCT((MONTH(Tabela2[Data])=$F$5)*(Tabela2[Matéria]=B7)*Tabela2[Horas]),\"\")","v":0},{"$f":"IFERROR(SUMPRODUCT((MONTH(Tabela2[Data])=$G$5)*(Tabela2[Matéria]=B7)*Tabela2[Horas]),\"\")","v":0},{"$f":"IFERROR(SUMPRODUCT((MONTH(Tabela2[Data])=$H$5)*(Tabela2[Matéria]=B7)*Tabela2[Horas]),\"\")","v":0},{"$f":"IFERROR(SUMPRODUCT((MONTH(Tabela2[Data])=$I$5)*(Tabela2[Matéria]=B7)*Tabela2[Horas]),\"\")","v":0},{"$f":"IFERROR(SUMPRODUCT((MONTH(Tabela2[Data])=$J$5)*(Tabela2[Matéria]=B7)*Tabela2[Horas]),\"\")","v":0},{"$f":"IFERROR(SUMPRODUCT((MONTH(Tabela2[Data])=$K$5)*(Tabela2[Matéria]=B7)*Tabela2[Horas]),\"\")","v":0},{"$f":"IFERROR(SUMPRODUCT((MONTH(Tabela2[Data])=$L$5)*(Tabela2[Matéria]=B7)*Tabela2[Horas]),\"\")","v":0},{"$f":"IFERROR(SUMPRODUCT((MONTH(Tabela2[Data])=$M$5)*(Tabela2[Matéria]=B7)*Tabela2[Horas]),\"\")","v":0},{"$f":"IFERROR(SUMPRODUCT((MONTH(Tabela2[Data])=$N$5)*(Tabela2[Matéria]=B7)*Tabela2[Horas]),\"\")","v":0},{"$nulls":7},"Fev",2,{"$f":"Configurações!C17","v":4.166666666666667},{"$f":"D26","v":0},{"$nulls":6},"Fev",2,{"$f":"SUMPRODUCT((MONTH(Tabela5[Data])=AG7)*(Tabela5[Questões]))","v":0},{"$f":"SUMPRODUCT((MONTH(Tabela5[Data])=AG7)*(Tabela5[Acertos]))","v":0},{"$f":"AH7-AI7","v":0},{"$f":"IFERROR(AI7/AH7,\"\")","v":""},{"$f":"IFERROR(AI7/AH7,\"\")","v":""},{"$f":"IFERROR(AJ7/AH7,\"\")","v":""},null,{"$f":"SUMIF(Tabela5[],AP7,Tabela5[Questões])","v":29},{"$f":"Edital!C17","v":"INFORMÁTICA"},null,3,{"$f":"LARGE($AO$5:$AO$24,3)","v":7},{"$f":"VLOOKUP(AS7,$AO$5:$AP$24,2,FALSE)","v":"LÍNGUA PORTUGUESA"},null,3,{"$f":"SMALL($AO$5:$AO$24,3)","v":0},{"$f":"VLOOKUP(AW7,$AO$5:$AP$24,2,)","v":0},null,"Mar",3,{"$f":"IFERROR(SUMPRODUCT((MONTH(Tabela5[Data])=BA7)*(Tabela5[Matéria]=Rel_Exer!$C$22)*(Tabela5[Questões])),\"\")","v":0},{"$f":"IFERROR(SUMPRODUCT((MONTH(Tabela5[Data])=BA7)*(Tabela5[Matéria]=Rel_Exer!$C$22)*(Tabela5[Acertos])),\"\")","v":0},0,"",""]
[null,{"$f":"Edital!C17","v":"INFORMÁTICA"},{"$f":"IFERROR(SUMPRODUCT((MONTH(Tabela2[Data])=$C$5)*(Tabela2[Matéria]=B8)*Tabela2[Horas]),\"\")","v":0},{"$f":"IFERROR(SUMPRODUCT((MONTH(Tabela2[Data])=$D$5)*(Tabela2[Matéria]=B8)*Tabela2[Horas]),\"\")","v":0},{"$f":"IFERROR(SUMPRODUCT((MONTH(Tabela2[Data])=$E$5)*(Tabela2[Matéria]=B8)*Tabela2[Horas]),\"\")","v":0},{"$f":"IFERROR(SUMPRODUCT((MONTH(Tabela2[Data])=$F$5)*(Tabela2[Matéria]=B8)*Tabela2[Horas]),\"\")","v":0},{"$f":"IFERROR(SUMPRODUCT((MONTH(Tabela2[Data])=$G$5)*(Tabela2[Matéria]=B8)*Tabela2[Horas]),\"\")","v":0},{"$f":"IFERROR(SUMPRODUCT((MONTH(Tabela2[Data])=$H$5)*(Tabela2[Matéria]=B8)*Tabela2[Horas]),\"\")","v":0},{"$f":"IFERROR(SUMPRODUCT((MONTH(Tabela2[Data])=$I$5)*(Tabela2[Matéria]=B8)*Tabela2[Horas]),\"\")","v":0},{"$f":"IFERROR(SUMPRODUCT((MONTH(Tabela2[Data])=$J$5)*(Tabela2[Matéria]=B8)*Tabela2[Horas]),\"\")","v":0},{"$f":"IFERROR(SUMPRODUCT((MONTH(Tabela2[Data])=$K$5)*(Tabela2[Matéria]=B8)*Tabela2[Horas]),\"\")","v":0},{"$f":"IFERROR(SUMPRODUCT((MONTH(Tabela2[Data])=$L$5)*(Tabela2[Matéria]=B8)*Tabela2[Horas]),\"\")","v":0},{"$f":"IFERROR(SUMPRODUCT((MONTH(Tabela2[Data])=$M$5)*(Tabela2[Matéria]=B8)*Tabela2[Horas]),\"\")","v":0},{"$f":"IFERROR(SUMPRODUCT((MONTH(Tabela2[Data])=$N$5)*(Tabela2[Matéria]=B8)*Tabela2[Horas]),\"\")","v":0},null,null,"Segundas",{"$f":"INT((WEEKDAY($R$5-2)-$R$5+$R6)/7)","v":8},{"$f":"Configurações!B10","v":"10:00:00"},{"$f":"IFERROR(R8*S8,\"\")","v":3.3333333333333335},null,"Mar",3,{"$f":"Configurações!C18","v":4.166666666666667},{"$f":"E26","v":0},{"$nulls":6},"Mar",3,{"$f":"SUMPRODUCT((MONTH(Tabela5[Data])=AG8)*(Tabela5[Questões]))","v":0},{"$f":"SUMPRODUCT((MONTH(Tabela5[Data])=AG8)*(Tabela5[Acertos]))","v":0},0,"","","",null,{"$f":"SUMIF(Tabela5[],AP8,Tabela5[Questões])","v":0},{"$f":"Edital!C18","v":0},null,4,{"$f":"LARGE($AO$5:$AO$24,4)","v":0},{"$f":"VLOOKUP(AS8,$AO$5:$AP$24,2,FALSE)","v":0},null,4,{"$f":"SMALL($AO$5:$AO$24,4)","v":0},{"$f":"VLOOKUP(AW8,$AO$5:$AP$24,2,)","v":0},null,"Abr",4,{"$f":"IFERROR(SUMPRODUCT((MONTH(Tabela5[Data])=BA8)*(Tabela5[Matéria]=Rel_Exer!$C$22)*(Tabela5[Questões])),\"\")","v":0},{"$f":"IFERROR(SUMPRODUCT((MONTH(Tabela5[Data])=BA8)*(Tabela5[Matéria]=Rel_Exer!$C$22)*(Tabela5[Acertos])),\"\")","v":0},0,"",""]
{"$rows_left_out":34}
{"sheet":"1","index":19,"n_rows":259,"n_cols":16,"rows_kept":259,"merged":[[6,1,6,2],[6,6,6,12],[8,1,8,2]]}
[]
[]
[]
[{"$nulls":10},"Assuntos","Finalizado","Pendentes"]
[{"$nulls":10},{"$f":"COUNTA(O10:O259)","v":2},{"$f":"COUNTIF(O10:O259,\"Sim\")","v":1},{"$f":"K5-L5","v":1},null,{"$f":"L5/K5","v":{"v":0.5,"d":"50%"}}]
[]
[null,{"$f":"Edital!C15","v":"LÍNGUA PORTUGUESA"},null,null,"Teoria",null,"Revisões",{"$nulls":7},"Teoria",{"$f":"COUNTIF($P$10:$P$259,\"<>0\")","v":0}]
[]
{"$rows_left_out":252}
{"sheet":"2","index":20,"n_rows":259,"n_cols":16,"rows_kept":259,"merged":[[6,1,6,2],[6,6,6,12],[8,1,8,2]]}
[]
[]
[]
[{"$nulls":10},"Assuntos","Finalizado","Pendentes"]
[{"$nulls":10},{"$f":"COUNTA(O10:O259)","v":0},{"$f":"COUNTIF(O10:O259,\"Sim\")","v":0},{"$f":"K5-L5","v":0},null,{"$f":"L5/K5","v":{"$error":"#DIV/0!"}}]
[]
[null,{"$f":"Edital!C16","v":"RACIOCÍNIO LÓGICO MATEMÁTICO"},null,null,"Teoria",null,"Revisões",{"$nulls":7},"Teoria",{"$f":"COUNTIF($P$10:$P$259,\"<>0\")","v":0}]
[]
{"$rows_left_out":252}
{"sheet":"3","index":21,"n_rows":259,"n_cols":16,"rows_kept":259,"merged":[[6,1,6,2],[6,6,6,12],[8,1,8,2]]}
[]
[]
[]
[{"$nulls":10},"Assuntos","Finalizado","Pendentes"]
[{"$nulls":10},{"$f":"COUNTA(O10:O259)","v":0},{"$f":"COUNTIF(O10:O259,\"Sim\")","v":0},{"$f":"K5-L5","v":0},null,{"$f":"L5/K5","v":{"$error":"#DIV/0!"}}]
[]
[null,{"$f":"Edital!C17","v":"INFORMÁTICA"},null,null,"Teoria",null,"Revisões",{"$nulls":7},"Teoria",{"$f":"COUNTIF($P$10:$P$259,\"<>0\")","v":0}]
[]
{"$rows_left_out":251}