{"text_format":"3","workbook":"xlsx","n_sheets":22,"sheets":["Contato","Dashboard","Edital","Ciclo","Grade","Horas","Exercícios","Simulados","Videoaulas","Leitura","ConcursosPrevistos","ConcursosRealizados","Financeiro","Rel_Exer","Rel_Sim","Rel_Horas","Rel_Fin","Configurações","Dados","1","2","3"],"not_rendered":{"charts":11,"images":22,"macros":1,"defined_names":14,"comments":6},"read":"whole","date_system":"1900"}

{"sheet":"Contato","index":0,"n_rows":21,"n_cols":2,"rows_kept":21}
{"$rows_empty":20}
[null,"ícones: designed by  Flat Icons, Freepik, Flat Icons from Flaticon\n\n"]

{"sheet":"Dashboard","index":1,"n_rows":50,"n_cols":21,"rows_kept":50,"merged":[[9,1,9,7],[9,9,9,15],[10,1,10,7],[10,9,10,15],[11,1,11,7],[11,9,11,15],[12,1,12,7],[12,9,12,15],[13,1,13,7],[13,9,13,15],[14,1,14,7],[14,9,14,15],[15,1,15,7],[15,9,15,15],[16,1,16,7],[16,9,16,15],[17,1,17,7],[17,9,17,15],[18,1,18,7],[18,9,18,15],[19,1,19,7],[19,9,19,15]]}
[]
[]
[null,{"$f":"\"Faltam \"&E49&\" dias (\"&E50&\" semanas)\"&\" para o concurso\"","v":"Faltam 54 dias (7 semanas) para o concurso"}]
[]
[{"$nulls":17},"Mês","Meta","Realizado"]
[{"$nulls":17},{"$f":"MONTH(NOW())","v":12},{"$f":"VLOOKUP(R6,Dados!W6:Y17,2,FALSE)","v":5.833333333333333},{"$f":"VLOOKUP(R6,Dados!W6:Y17,3,FALSE)","v":0}]
[{"$nulls":17},{"$f":"UPPER(TEXT(R6,\"MMMM\"))","v":"JANEIRO"},{"$f":"S6","v":5.833333333333333},{"$f":"T6","v":0},{"$f":"T7/S7","v":{"v":0,"d":"0%"}}]
[]
[null,"LEMBRETES",{"$nulls":7},"LEMBRETES",{"$nulls":6},{"$f":"IF(S9=1,\"Dom\",IF(S9=2,\"Seg\",IF(S9=3,\"Ter\",IF(S9=4,\"Qua\",IF(S9=5,\"Qui\",IF(S9=6,\"Sex\",IF(S9=7,\"Sáb\")))))))","v":"Qua"},{"$f":"IF(S9=1,\"Domingo\",IF(S9=2,\"Segunda\",IF(S9=3,\"Terça\",IF(S9=4,\"Quarta\",IF(S9=5,\"Quinta\",IF(S9=6,\"Sexta\",IF(S9=7,\"Sábado\")))))))","v":"Quarta"},{"$f":"WEEKDAY(T9)","v":4},{"$f":"T10-1","v":"2018-12-05"},{"$f":"IFERROR(SUMIFS(Tabela2[Horas],Tabela2[Data],\"=\"&T9),\"\")","v":0}]
[null,"ANOTAR NA APOSTILA ARTIGOS MAIS COBRADOS",{"$nulls":14},{"$f":"IF(S10=1,\"Dom\",IF(S10=2,\"Seg\",IF(S10=3,\"Ter\",IF(S10=4,\"Qua\",IF(S10=5,\"Qui\",IF(S10=6,\"Sex\",IF(S10=7,\"Sáb\")))))))","v":"Qui"},"Quinta",5,"2018-12-06",{"$f":"IFERROR(SUMIFS(Tabela2[Horas],Tabela2[Data],\"=\"&T10),\"\")","v":0}]
[{"$nulls":16},"Sex","Sexta",6,"2018-12-07",{"$f":"IFERROR(SUMIFS(Tabela2[Horas],Tabela2[Data],\"=\"&T11),\"\")","v":0}]
[{"$nulls":16},"Sáb","Sábado",7,"2018-12-08",{"$f":"IFERROR(SUMIFS(Tabela2[Horas],Tabela2[Data],\"=\"&T12),\"\")","v":0}]
[{"$nulls":16},"Dom","Domingo",1,"2018-12-09",{"$f":"IFERROR(SUMIFS(Tabela2[Horas],Tabela2[Data],\"=\"&T13),\"\")","v":0}]
[{"$nulls":16},"Seg",{"$f":"IF(S14=1,\"Domingo\",IF(S14=2,\"Segunda\",IF(S14=3,\"Terça\",IF(S14=4,\"Quarta\",IF(S14=5,\"Quinta\",IF(S14=6,\"Sexta\",IF(S14=7,\"Sábado\")))))))","v":"Segunda"},2,"2018-12-10",{"$f":"IFERROR(SUMIFS(Tabela2[Horas],Tabela2[Data],\"=\"&T14),\"\")","v":0}]
[{"$nulls":16},{"$f":"IF(S15=1,\"Dom (Hoje)\",IF(S15=2,\"Seg (Hoje)\",IF(S15=3,\"Ter (Hoje)\",IF(S15=4,\"Qua (Hoje)\",IF(S15=5,\"Qui (Hoje)\",IF(S15=6,\"Sex (Hoje)\",IF(S15=7,\"Sáb (Hoje)\")))))))","v":"Ter (Hoje)"},{"$f":"IF(S15=1,\"Domingo (Hoje)\",IF(S15=2,\"Segunda (Hoje)\",IF(S15=3,\"Terça (Hoje)\",IF(S15=4,\"Quarta (Hoje)\",IF(S15=5,\"Quinta (Hoje)\",IF(S15=6,\"Sexta (Hoje)\",IF(S15=7,\"Sábado (Hoje)\")))))))","v":"Terça (Hoje)"},{"$f":"WEEKDAY(T15)","v":3},{"$f":"TODAY()","v":"2018-12-11"},{"$f":"IFERROR(SUMIFS(Tabela2[Horas],Tabela2[Data],\"=\"&T15),\"\")","v":0}]
{"$rows_empty":30}
[null,"Início Estudos",null,{"$f":"Edital!I7","v":"2018-12-06"}]
[null,"Hoje",null,{"$f":"TODAY()","v":"2018-12-11"}]
[null,"Data Concurso",null,{"$f":"Edital!I9","v":"2019-02-03"}]
[{"$nulls":3},{"$f":"IF(D47>D46,D48-D47,D48-D46)","v":54},{"$f":"IF(D49<0,\"x\",D49)","v":54}]
[{"$nulls":3},{"$f":"INT((D49/7))","v":7},{"$f":"IF(D50<0,\"x\",D50)","v":7}]

{"sheet":"Edital","index":2,"n_rows":35,"n_cols":17,"rows_kept":35,"merged":[[6,1,6,2],[6,3,6,5],[6,8,6,9],[6,11,8,11],[8,1,8,2],[8,3,8,5],[8,8,8,9],[10,1,10,2],[10,3,10,5],[10,8,10,9],[13,1,13,3],[13,5,13,6],[14,2,14,3],[14,5,14,6],[15,2,15,3],[15,5,15,6],[16,2,16,3],[16,5,16,6],[17,2,17,3],[17,5,17,6],[18,2,18,3],[18,5,18,6],[19,2,19,3],[19,5,19,6],[20,2,20,3],[20,5,20,6],[21,2,21,3],[21,5,21,6],[22,2,22,3],[22,5,22,6],[23,2,23,3],[23,5,23,6],[24,2,24,3],[24,5,24,6],[25,2,25,3],[25,5,25,6],[26,2,26,3],[26,5,26,6],[27,2,27,3],[27,5,27,6],[28,2,28,3],[28,5,28,6],[29,2,29,3],[29,5,29,6],[30,2,30,3],[30,5,30,6],[31,2,31,3],[31,5,31,6],[32,2,32,3],[32,5,32,6],[33,2,33,3],[33,5,33,6]]}
[]
[]
[]
[]
[null,"Informações sobre o concurso que você irá prestar"]
[]
[null,"Concurso",null,"POLÍCIA RODOVIÁRIA FEDERAL",{"$nulls":3},"Início estudos","2018-12-06",null,null,{"$f":"Dashboard!D49","v":54},{"$nulls":4},{"$f":"Dados!T15","v":25}]
[]
[null,"Banca",null,"CEBRASPE",{"$nulls":3},"Data da prova","2019-02-03",{"$nulls":7},{"$f":"Q7","v":25}]
[]
[null,"Observações",{"$nulls":5},"Total de questões",{"$f":"SUM(F15:G34)","v":30},null,null,"Dias para o concurso"]
[]
[]
[null,"Matéria",null,null,"Sigla","Nº Questões",null,"Peso","Rel.","Assuntos estudados",null,"Recomendação"]
[null,null,"LÍNGUA PORTUGUESA",null,"PORT",10,null,1,{"$f":"IFERROR(IF(F15<>\"\",F15*H15/$I$35,\"\"),\"-\")","v":{"v":0.25,"d":"25%"}},{"$f":"IFERROR('1'!O5,\"\")","v":{"v":0.5,"d":"50%"}},null,{"$f":"IFERROR($Q$9*I15,\"\")","v":6.25},null,{"$f":"'1'!P7","v":0}]
[null,null,"RACIOCÍNIO LÓGICO MATEMÁTICO",null,"RLM",10,null,2,{"$f":"IFERROR(IF(F16<>\"\",F16*H16/$I$35,\"\"),\"-\")","v":{"v":0.5,"d":"50%"}},{"$f":"IFERROR('2'!O5,\"\")","v":""},null,{"$f":"IFERROR($Q$9*I16,\"\")","v":12.5},null,{"$f":"'2'!P7","v":0}]
[null,null,"INFORMÁTICA",null,"INFO",10,null,1,{"$f":"IFERROR(IF(F17<>\"\",F17*H17/$I$35,\"\"),\"-\")","v":{"v":0.25,"d":"25%"}},{"$f":"IFERROR('3'!O5,\"\")","v":""},null,{"$f":"IFERROR($Q$9*I17,\"\")","v":6.25},null,{"$f":"'3'!P7","v":0}]
[{"$nulls":8},{"$f":"IFERROR(IF(F18<>\"\",F18*H18/$I$35,\"\"),\"-\")","v":""},{"$f":"IFERROR(#REF!,\"\")","v":""},null,"",null,{"$f":"#REF!","v":{"$error":"#REF!"}}]
[{"$nulls":8},"",{"$f":"IFERROR(#REF!,\"\")","v":""},null,"",null,{"$f":"#REF!","v":{"$error":"#REF!"}}]
[{"$nulls":8},"",{"$f":"IFERROR(#REF!,\"\")","v":""},null,"",null,{"$f":"#REF!","v":{"$error":"#REF!"}}]
[{"$nulls":8},"",{"$f":"IFERROR(#REF!,\"\")","v":""},null,"",null,{"$f":"#REF!","v":{"$error":"#REF!"}}]
[{"$nulls":8},"",{"$f":"IFERROR(#REF!,\"\")","v":""},null,"",null,{"$f":"#REF!","v":{"$error":"#REF!"}}]
[{"$nulls":8},"",{"$f":"IFERROR(#REF!,\"\")","v":""},null,"",null,{"$f":"#REF!","v":{"$error":"#REF!"}}]
[{"$nulls":8},"",{"$f":"IFERROR(#REF!,\"\")","v":""},null,"",null,{"$f":"#REF!","v":{"$error":"#REF!"}}]
[{"$nulls":8},"",{"$f":"IFERROR(#REF!,\"\")","v":""},null,"",null,{"$f":"#REF!","v":{"$error":"#REF!"}}]
[{"$nulls":8},"",{"$f":"IFERROR(#REF!,\"\")","v":""},null,"",null,{"$f":"#REF!","v":{"$error":"#REF!"}}]
[{"$nulls":8},"",{"$f":"IFERROR(#REF!,\"\")","v":""},null,"",null,{"$f":"#REF!","v":{"$error":"#REF!"}}]
[{"$nulls":8},"",{"$f":"IFERROR(#REF!,\"\")","v":""},null,"",null,{"$f":"#REF!","v":{"$error":"#REF!"}}]
[{"$nulls":8},"",{"$f":"IFERROR(#REF!,\"\")","v":""},null,"",null,{"$f":"#REF!","v":{"$error":"#REF!"}}]
[{"$nulls":8},"",{"$f":"IFERROR(#REF!,\"\")","v":""},null,"",null,{"$f":"#REF!","v":{"$error":"#REF!"}}]
[{"$nulls":8},"",{"$f":"IFERROR(#REF!,\"\")","v":""},null,"",null,{"$f":"#REF!","v":{"$error":"#REF!"}}]
[{"$nulls":8},"",{"$f":"IFERROR(#REF!,\"\")","v":""},null,"",null,{"$f":"#REF!","v":{"$error":"#REF!"}}]
[{"$nulls":8},"",{"$f":"IFERROR(#REF!,\"\")","v":""},null,"",null,{"$f":"#REF!","v":{"$error":"#REF!"}}]
[{"$nulls":8},"",{"$f":"IFERROR(#REF!,\"\")","v":""},null,"",null,{"$f":"#REF!","v":{"$error":"#REF!"}}]
[null,null,{"$f":"COUNTA(C15:D34)","v":3},{"$nulls":5},{"$f":"SUMPRODUCT(F15:F34,H15:H34)","v":40}]

{"sheet":"Ciclo","index":3,"n_rows":21,"n_cols":15,"rows_kept":21,"merged":[[4,1,4,4],[4,7,4,10],[5,1,5,2],[5,7,5,8]]}
[]
[]
[]
[]
[null,"Ciclo 1",{"$nulls":5},"Ciclo 2",{"$nulls":4},{"$f":"COUNTA(E7:E21)","v":2},{"$f":"COUNTIF(E7:E21,\"Sim\")","v":2},{"$f":"N5&\"/\"&M5","v":"2/2"}]
[null,"Matéria",null,"Horas","Estudou?",null,null,"Matéria",null,"Horas","Estudou?",null,{"$f":"SUM(D7:D21)","v":0.14583333333333331},{"$f":"M6","v":0.14583333333333331}]
[null,1,"DIREITO ADMINISTRATIVO","01:30:00","Sim",{"$f":"D7","v":0.0625},null,1,{"$nulls":3},{"$f":"J7","v":0},{"$f":"SUMIF(E7:E21,\"Sim\",D7:D21)","v":0.14583333333333331},{"$f":"M7","v":0.14583333333333331},{"$f":"N7/N6","v":{"v":1,"d":"100%"}}]
[null,2,"DIREITO PENAL","02:00:00","Sim",{"$f":"D8","v":0.08333333333333333},null,2,{"$nulls":3},{"$f":"J8","v":0},{"$f":"M6-M7","v":0},{"$f":"M8","v":0}]
[null,3,{"$nulls":3},0,null,3,{"$nulls":3},0]
[null,4,{"$nulls":3},0,null,4,{"$nulls":3},0]
[null,5,{"$nulls":3},0,null,5,{"$nulls":3},0,{"$f":"COUNTA(K7:K21)","v":0},{"$f":"COUNTIF(K7:K21,\"Sim\")","v":0},{"$f":"N11&\"/\"&M11","v":"0/0"}]
[null,6,{"$nulls":3},0,null,6,{"$nulls":3},0,{"$f":"SUM(J7:J21)","v":0},{"$f":"M12","v":0}]
[null,7,{"$nulls":3},0,null,7,{"$nulls":3},0,{"$f":"SUMIF(K7:K21,\"Sim\",J7:J21)","v":0},{"$f":"M13","v":0},{"$f":"N13/N12","v":{"$error":"#DIV/0!"}}]
[null,8,{"$nulls":3},0,null,8,{"$nulls":3},0,{"$f":"M12-M13","v":0},{"$f":"M14","v":0}]
[null,9,{"$nulls":3},0,null,9,{"$nulls":3},0]
[null,10,{"$nulls":3},0,null,10,{"$nulls":3},0]
[null,11,{"$nulls":3},0,null,11,{"$nulls":3},0]
[null,12,{"$nulls":3},0,null,12,{"$nulls":3},0]
[null,13,{"$nulls":3},0,null,13,{"$nulls":3},0]
[null,14,{"$nulls":3},0,null,14,{"$nulls":3},0]
[null,15,{"$nulls":3},0,null,15,{"$nulls":3},0]

{"sheet":"Grade","index":4,"n_rows":23,"n_cols":9,"rows_kept":23,"merged":[[7,10,8,10],[9,10,10,10]]}
[]
[]
[{"$nulls":8},"Dica"]
[]
[null,"Horário","Segunda","Terça","Quarta","Quinta","Sexta","Sábado","Domingo"]
[null,"06h - 07h"]
[null,"07h - 08h"]
[null,"08h - 09h"]
[null,"09h - 10h"]
[null,"10h - 11h"]
[null,"11h - 12h"]
[null,"12h - 13h"]
[null,"13h - 14h"]
[null,"14h - 15h"]
[null,"15h - 16h"]
[null,"16h - 17h"]
[null,"17h - 18h"]
[null,"18h - 19h"]
[null,"19h - 20h"]
[null,"20h - 21h"]
[null,"21h - 22h"]
[null,"22h - 23h"]
[null,"23h - 24h"]

{"sheet":"Horas","index":5,"n_rows":11,"n_cols":12,"rows_kept":11}
[]
[{"$nulls":6},"►","Hoje",{"$f":"TODAY()","v":"2018-12-11"},{"$f":"IFERROR(SUMIFS(Tabela2[Horas],Tabela2[Data],\"=\"&I2),\"\")","v":0}]
[{"$nulls":6},"II",null,{"$f":"I2-WEEKDAY(I2,2)+1","v":"2018-12-10"},{"$f":"SUMIFS(Tabela2[Horas],Tabela2[Data],\">=\"&I4,Tabela2[Data],\"<=\"&I6)","v":0}]
[{"$nulls":8},{"$f":"I3","v":"2018-12-10"},null,null,{"$f":"DATE(YEAR(I2),MONTH(I2)+1,0)","v":"2018-12-31"}]
[{"$nulls":7},"Ult.dia.sema",{"$f":"I4+6","v":"2018-12-16"}]
[{"$nulls":8},{"$f":"I5","v":"2018-12-16"}]
[]
[]
[]
[]
[null,"Data","Matéria","Assunto","Horas"]

{"sheet":"Exercícios","index":6,"n_rows":12,"n_cols":10,"rows_kept":12,"merged":[[5,4,5,5]]}
[]
[]
[]
[{"$nulls":8},{"$f":"G6","v":{"v":0.65,"d":"65%"}}]
[]
[{"$nulls":4},"Marcar assuntos que eu acertar menos que:",null,{"v":0.65,"d":"65%"},null,{"$f":"SUBTOTAL(9,Tabela5[Questões])","v":74}]
[{"$nulls":8},{"$f":"SUBTOTAL(9,Tabela5[Acertos])","v":54},{"$f":"I6-I7","v":20}]
[]
[null,"Data","Matéria","Anotações","Questões","Acertos","%"]
[null,"2018-12-15","LÍNGUA PORTUGUESA",null,10,7,{"$f":"IFERROR(Tabela5[[#This Row],[Acertos]]/Tabela5[[#This Row],[Questões]],\"\")","v":{"v":0.7,"d":"70%"}}]
[null,"2018-12-16","INFORMÁTICA",null,45,29,{"$f":"IFERROR(Tabela5[[#This Row],[Acertos]]/Tabela5[[#This Row],[Questões]],\"\")","v":{"v":0.6444444444444445,"d":"64%"}}]
[null,"2018-12-17","RACIOCÍNIO LÓGICO MATEMÁTICO",null,19,18,{"$f":"IFERROR(Tabela5[[#This Row],[Acertos]]/Tabela5[[#This Row],[Questões]],\"\")","v":{"v":0.9473684210526315,"d":"95%"}}]

{"sheet":"Simulados","index":7,"n_rows":37,"n_cols":122,"rows_kept":37,"merged":[[4,3,4,7],[4,9,4,13],[4,15,4,19],[4,21,4,25],[4,27,4,31],[4,33,4,37],[4,39,4,43],[4,45,4,49],[4,51,4,55],[4,57,4,61],[4,63,4,67],[4,69,4,73],[4,75,4,79],[4,81,4,85],[4,87,4,91],[4,93,4,97],[4,99,4,103],[4,105,4,109],[4,111,4,115],[4,117,4,121],[5,3,5,4],[5,5,5,7],[5,9,5,10],[5,11,5,13],[5,15,5,16],[5,17,5,19],[5,21,5,22],[5,23,5,25],[5,27,5,28],[5,29,5,31],[5,33,5,34],[5,35,5,37],[5,39,5,40],[5,41,5,43],[5,45,5,46],[5,47,5,49],[5,51,5,52],[5,53,5,55],[5,57,5,58],[5,59,5,61],[5,63,5,64],[5,65,5,67],[5,69,5,70],[5,71,5,73],[5,75,5,76],[5,77,5,79],[5,81,5,82],[5,83,5,85],[5,87,5,88],[5,89,5,91],[5,93,5,94],[5,95,5,97],[5,99,5,100],[5,101,5,103],[5,105,5,106],[5,107,5,109],[5,111,5,112],[5,113,5,115],[5,117,5,118],[5,119,5,121],[6,3,6,4],[6,5,6,7],[6,9,6,10],[6,11,6,13],[6,15,6,16],[6,17,6,19],[6,21,6,22],[6,23,6,25],[6,27,6,28],[6,29,6,31],[6,33,6,34],[6,35,6,37],[6,39,6,40],[6,41,6,43],[6,45,6,46],[6,47,6,49],[6,51,6,52],[6,53,6,55],[6,57,6,58],[6,59,6,61],[6,63,6,64],[6,65,6,67],[6,69,6,70],[6,71,6,73],[6,75,6,76],[6,77,6,79],[6,81,6,82],[6,83,6,85],[6,87,6,88],[6,89,6,91],[6,93,6,94],[6,95,6,97],[6,99,6,100],[6,101,6,103],[6,105,6,106],[6,107,6,109],[6,111,6,112],[6,113,6,115],[6,117,6,118],[6,119,6,121],[7,3,7,4],[7,5,7,7],[7,9,7,10],[7,11,7,13],[7,15,7,16],[7,17,7,19],[7,21,7,22],[7,23,7,25],[7,27,7,28],[7,29,7,31],[7,33,7,34],[7,35,7,37],[7,39,7,40],[7,41,7,43],[7,45,7,46],[7,47,7,49],[7,51,7,52],[7,53,7,55],[7,57,7,58],[7,59,7,61],[7,63,7,64],[7,65,7,67],[7,69,7,70],[7,71,7,73],[7,75,7,76],[7,77,7,79],[7,81,7,82],[7,83,7,85],[7,87,7,88],[7,89,7,91],[7,93,7,94],[7,95,7,97],[7,99,7,100],[7,101,7,103],[7,105,7,106],[7,107,7,109],[7,111,7,112],[7,113,7,115],[7,117,7,118],[7,119,7,121],[8,3,8,4],[8,5,8,7],[8,9,8,10],[8,11,8,13],[8,15,8,16],[8,17,8,19],[8,21,8,22],[8,23,8,25],[8,27,8,28],[8,29,8,31],[8,33,8,34],[8,35,8,37],[8,39,8,40],[8,41,8,43],[8,45,8,46],[8,47,8,49],[8,51,8,52],[8,53,8,55],[8,57,8,58],[8,59,8,61],[8,63,8,64],[8,65,8,67],[8,69,8,70],[8,71,8,73],[8,75,8,76],[8,77,8,79],[8,81,8,82],[8,83,8,85],[8,87,8,88],[8,89,8,91],[8,93,8,94],[8,95,8,97],[8,99,8,100],[8,101,8,103],[8,105,8,106],[8,107,8,109],[8,111,8,112],[8,113,8,115],[8,117,8,118],[8,119,8,121]]}
[]
[]
[]
[]
[null,"Legenda",null,"SIMULADO 1",{"$nulls":5},"SIMULADO 2",{"$nulls":5},"SIMULADO 3",{"$nulls":5},"SIMULADO 4",{"$nulls":5},"SIMULADO 5",{"$nulls":5},"SIMULADO 6",{"$nulls":5},"SIMULADO 7",{"$nulls":5},"SIMULADO 8",{"$nulls":5},"SIMULADO 9",{"$nulls":5},"SIMULADO 10",{"$nulls":5},"SIMULADO 11",{"$nulls":5},"SIMULADO 12",{"$nulls":5},"SIMULADO 13",{"$nulls":5},"SIMULADO 14",{"$nulls":5},"SIMULADO 15",{"$nulls":5},"SIMULADO 16",{"$nulls":5},"SIMULADO 17",{"$nulls":5},"SIMULADO 18",{"$nulls":5},"SIMULADO 19",{"$nulls":5},"SIMULADO 20"]
[null,"Q = Número de questões",null,"Data",null,"2018-09-20",{"$nulls":3},"Data",{"$nulls":5},"Data",{"$nulls":5},"Data",{"$nulls":5},"Data",{"$nulls":5},"Data",{"$nulls":5},"Data",{"$nulls":5},"Data",{"$nulls":5},"Data",{"$nulls":5},"Data",{"$nulls":5},"Data",{"$nulls":5},"Data",{"$nulls":5},"Data",{"$nulls":5},"Data",{"$nulls":5},"Data",{"$nulls":5},"Data",{"$nulls":5},"Data",{"$nulls":5},"Data",{"$nulls":5},"Data",{"$nulls":5},"Data"]
[null,"A = Acertos",null,"Banca",null,"VUNESP",{"$nulls":3},"Banca",{"$nulls":5},"Banca",{"$nulls":5},"Banca",{"$nulls":5},"Banca",{"$nulls":5},"Banca",{"$nulls":5},"Banca",{"$nulls":5},"Banca",{"$nulls":5},"Banca",{"$nulls":5},"Banca",{"$nulls":5},"Banca",{"$nulls":5},"Banca",{"$nulls":5},"Banca",{"$nulls":5},"Banca",{"$nulls":5},"Banca",{"$nulls":5},"Banca",{"$nulls":5},"Banca",{"$nulls":5},"Banca",{"$nulls":5},"Banca",{"$nulls":5},"Banca"]
[null,"B = Questões em branco",null,"NC",null,{"v":0.8,"d":"80%"},{"$nulls":3},"NC",{"$nulls":5},"NC",{"$nulls":5},"NC",{"$nulls":5},"NC",{"$nulls":5},"NC",{"$nulls":5},"NC",{"$nulls":5},"NC",{"$nulls":5},"NC",{"$nulls":5},"NC",{"$nulls":5},"NC",{"$nulls":5},"NC",{"$nulls":5},"NC",{"$nulls":5},"NC",{"$nulls":5},"NC",{"$nulls":5},"NC",{"$nulls":5},"NC",{"$nulls":5},"NC",{"$nulls":5},"NC",{"$nulls":5},"NC"]
[null,"E = Questões erradas (automático)",null,"Média",null,{"$f":"IFERROR(IF(F7=\"CESPE\",E37,E36),\"--\")","v":""},{"$nulls":3},"Média",null,{"$f":"IFERROR(IF(L7=\"CESPE\",K37,K36),\"--\")","v":""},{"$nulls":3},"Média",null,{"$f":"IFERROR(IF(R7=\"CESPE\",Q37,Q36),\"--\")","v":""},{"$nulls":3},"Média",null,{"$f":"IFERROR(IF(X7=\"CESPE\",W37,W36),\"--\")","v":""},{"$nulls":3},"Média",null,{"$f":"IFERROR(IF(AD7=\"CESPE\",AC37,AC36),\"--\")","v":""},{"$nulls":3},"Média",null,{"$f":"IFERROR(IF(AJ7=\"CESPE\",AI37,AI36),\"--\")","v":""},{"$nulls":3},"Média",null,{"$f":"IFERROR(IF(AP7=\"CESPE\",AO37,AO36),\"--\")","v":""},{"$nulls":3},"Média",null,{"$f":"IFERROR(IF(AV7=\"CESPE\",AU37,AU36),\"--\")","v":""},{"$nulls":3},"Média",null,{"$f":"IFERROR(IF(BB7=\"CESPE\",BA37,BA36),\"--\")","v":""},{"$nulls":3},"Média",null,{"$f":"IFERROR(IF(BH7=\"CESPE\",BG37,BG36),\"--\")","v":""},{"$nulls":3},"Média",null,{"$f":"IFERROR(IF(BN7=\"CESPE\",BM37,BM36),\"--\")","v":""},{"$nulls":3},"Média",null,{"$f":"IFERROR(IF(BT7=\"CESPE\",BS37,BS36),\"--\")","v":""},{"$nulls":3},"Média",null,{"$f":"IFERROR(IF(BZ7=\"CESPE\",BY37,BY36),\"--\")","v":""},{"$nulls":3},"Média",null,{"$f":"IFERROR(IF(CF7=\"CESPE\",CE37,CE36),\"--\")","v":""},{"$nulls":3},"Média",null,{"$f":"IFERROR(IF(CL7=\"CESPE\",CK37,CK36),\"--\")","v":""},{"$nulls":3},"Média",null,{"$f":"IFERROR(IF(CR7=\"CESPE\",CQ37,CQ36),\"--\")","v":""},{"$nulls":3},"Média",null,{"$f":"IFERROR(IF(CX7=\"CESPE\",CW37,CW36),\"--\")","v":""},{"$nulls":3},"Média",null,{"$f":"IFERROR(IF(DD7=\"CESPE\",DC37,DC36),\"--\")","v":""},{"$nulls":3},"Média",null,{"$f":"IFERROR(IF(DJ7=\"CESPE\",DI37,DI36),\"--\")","v":""},{"$nulls":3},"Média",null,{"$f":"IFERROR(IF(DP7=\"CESPE\",DO37,DO36),\"--\")","v":""}]
[]
[null,"Matérias",null,"Q","A","B","E","%",null,"Q","A","B","E","%",null,"Q","A","B","E","%",null,"Q","A","B","E","%",null,"Q","A","B","E","%",null,"Q","A","B","E","%",null,"Q","A","B","E","%",null,"Q","A","B","E","%",null,"Q","A","B","E","%",null,"Q","A","B","E","%",null,"Q","A","B","E","%",null,"Q","A","B","E","%",null,"Q","A","B","E","%",null,"Q","A","B","E","%",null,"Q","A","B","E","%",null,"Q","A","B","E","%",null,"Q","A","B","E","%",null,"Q","A","B","E","%",null,"Q","A","B","E","%",null,"Q","A","B","E","%"]
[null,{"$f":"Edital!C15","v":"LÍNGUA PORTUGUESA"},{"$nulls":4},{"$f":"D12-E12-F12","v":0},{"$f":"IFERROR(E12/D12,\"\")","v":""},{"$nulls":4},{"$f":"J12-K12-L12","v":0},{"$f":"IFERROR(K12/J12,\"\")","v":""},{"$nulls":4},{"$f":"P12-Q12-R12","v":0},{"$f":"IFERROR(Q12/P12,\"\")","v":""},{"$nulls":4},{"$f":"V12-W12-X12","v":0},{"$f":"IFERROR(W12/V12,\"\")","v":""},{"$nulls":4},{"$f":"AB12-AC12-AD12","v":0},{"$f":"IFERROR(AC12/AB12,\"\")","v":""},{"$nulls":4},{"$f":"AH12-AI12-AJ12","v":0},{"$f":"IFERROR(AI12/AH12,\"\")","v":""},{"$nulls":4},{"$f":"AN12-AO12-AP12","v":0},{"$f":"IFERROR(AO12/AN12,\"\")","v":""},{"$nulls":4},{"$f":"AT12-AU12-AV12","v":0},{"$f":"IFERROR(AU12/AT12,\"\")","v":""},{"$nulls":4},{"$f":"AZ12-BA12-BB12","v":0},{"$f":"IFERROR(BA12/AZ12,\"\")","v":""},{"$nulls":4},{"$f":"BF12-BG12-BH12","v":0},{"$f":"IFERROR(BG12/BF12,\"\")","v":""},{"$nulls":4},{"$f":"BL12-BM12-BN12","v":0},{"$f":"IFERROR(BM12/BL12,\"\")","v":""},{"$nulls":4},{"$f":"BR12-BS12-BT12","v":0},{"$f":"IFERROR(BS12/BR12,\"\")","v":""},{"$nulls":4},{"$f":"BX12-BY12-BZ12","v":0},{"$f":"IFERROR(BY12/BX12,\"\")","v":""},{"$nulls":4},{"$f":"CD12-CE12-CF12","v":0},{"$f":"IFERROR(CE12/CD12,\"\")","v":""},{"$nulls":4},{"$f":"CJ12-CK12-CL12","v":0},{"$f":"IFERROR(CK12/CJ12,\"\")","v":""},{"$nulls":4},{"$f":"CP12-CQ12-CR12","v":0},{"$f":"IFERROR(CQ12/CP12,\"\")","v":""},{"$nulls":4},{"$f":"CV12-CW12-CX12","v":0},{"$f":"IFERROR(CW12/CV12,\"\")","v":""},{"$nulls":4},{"$f":"DB12-DC12-DD12","v":0},{"$f":"IFERROR(DC12/DB12,\"\")","v":""},{"$nulls":4},{"$f":"DH12-DI12-DJ12","v":0},{"$f":"IFERROR(DI12/DH12,\"\")","v":""},{"$nulls":4},{"$f":"DN12-DO12-DP12","v":0},{"$f":"IFERROR(DO12/DN12,\"\")","v":""}]
[null,{"$f":"Edital!C16","v":"RACIOCÍNIO LÓGICO MATEMÁTICO"},{"$nulls":4},{"$f":"D13-E13-F13","v":0},"",{"$nulls":4},{"$f":"J13-K13-L13","v":0},"",{"$nulls":4},{"$f":"P13-Q13-R13","v":0},"",{"$nulls":4},{"$f":"V13-W13-X13","v":0},"",{"$nulls":4},{"$f":"AB13-AC13-AD13","v":0},"",{"$nulls":4},{"$f":"AH13-AI13-AJ13","v":0},"",{"$nulls":4},{"$f":"AN13-AO13-AP13","v":0},"",{"$nulls":4},{"$f":"AT13-AU13-AV13","v":0},"",{"$nulls":4},{"$f":"AZ13-BA13-BB13","v":0},"",{"$nulls":4},{"$f":"BF13-BG13-BH13","v":0},"",{"$nulls":4},{"$f":"BL13-BM13-BN13","v":0},"",{"$nulls":4},{"$f":"BR13-BS13-BT13","v":0},"",{"$nulls":4},{"$f":"BX13-BY13-BZ13","v":0},"",{"$nulls":4},{"$f":"CD13-CE13-CF13","v":0},"",{"$nulls":4},{"$f":"CJ13-CK13-CL13","v":0},"",{"$nulls":4},{"$f":"CP13-CQ13-CR13","v":0},"",{"$nulls":4},{"$f":"CV13-CW13-CX13","v":0},"",{"$nulls":4},{"$f":"DB13-DC13-DD13","v":0},"",{"$nulls":4},{"$f":"DH13-DI13-DJ13","v":0},"",{"$nulls":4},{"$f":"DN13-DO13-DP13","v":0},""]
[null,{"$f":"Edital!C17","v":"INFORMÁTICA"},{"$nulls":4},{"$f":"D14-E14-F14","v":0},"",{"$nulls":4},{"$f":"J14-K14-L14","v":0},"",{"$nulls":4},{"$f":"P14-Q14-R14","v":0},"",{"$nulls":4},{"$f":"V14-W14-X14","v":0},"",{"$nulls":4},{"$f":"AB14-AC14-AD14","v":0},"",{"$nulls":4},{"$f":"AH14-AI14-AJ14","v":0},"",{"$nulls":4},{"$f":"AN14-AO14-AP14","v":0},"",{"$nulls":4},{"$f":"AT14-AU14-AV14","v":0},"",{"$nulls":4},{"$f":"AZ14-BA14-BB14","v":0},"",{"$nulls":4},{"$f":"BF14-BG14-BH14","v":0},"",{"$nulls":4},{"$f":"BL14-BM14-BN14","v":0},"",{"$nulls":4},{"$f":"BR14-BS14-BT14","v":0},"",{"$nulls":4},{"$f":"BX14-BY14-BZ14","v":0},"",{"$nulls":4},{"$f":"CD14-CE14-CF14","v":0},"",{"$nulls":4},{"$f":"CJ14-CK14-CL14","v":0},"",{"$nulls":4},{"$f":"CP14-CQ14-CR14","v":0},"",{"$nulls":4},{"$f":"CV14-CW14-CX14","v":0},"",{"$nulls":4},{"$f":"DB14-DC14-DD14","v":0},"",{"$nulls":4},{"$f":"DH14-DI14-DJ14","v":0},"",{"$nulls":4},{"$f":"DN14-DO14-DP14","v":0},""]
[null,{"$f":"Edital!C18","v":0},{"$nulls":4},0,"",{"$nulls":4},0,"",{"$nulls":4},0,"",{"$nulls":4},0,"",{"$nulls":4},0,"",{"$nulls":4},0,"",{"$nulls":4},0,"",{"$nulls":4},0,"",{"$nulls":4},0,"",{"$nulls":4},0,"",{"$nulls":4},0,"",{"$nulls":4},0,"",{"$nulls":4},0,"",{"$nulls":4},0,"",{"$nulls":4},0,"",{"$nulls":4},0,"",{"$nulls":4},0,"",{"$nulls":4},0,"",{"$nulls":4},0,"",{"$nulls":4},0,""]
[null,{"$f":"Edital!C19","v":0},{"$nulls":4},0,"",{"$nulls":4},0,"",{"$nulls":4},0,"",{"$nulls":4},0,"",{"$nulls":4},0,"",{"$nulls":4},0,"",{"$nulls":4},0,"",{"$nulls":4},0,"",{"$nulls":4},0,"",{"$nulls":4},0,"",{"$nulls":4},0,"",{"$nulls":4},0,"",{"$nulls":4},0,"",{"$nulls":4},0,"",{"$nulls":4},0,"",{"$nulls":4},0,"",{"$nulls":4},0,"",{"$nulls":4},0,"",{"$nulls":4},0,"",{"$nulls":4},0,""]
[null,{"$f":"Edital!C20","v":0},{"$nulls":4},0,"",{"$nulls":4},0,"",{"$nulls":4},0,"",{"$nulls":4},0,"",{"$nulls":4},0,"",{"$nulls":4},0,"",{"$nulls":4},0,"",{"$nulls":4},0,"",{"$nulls":4},0,"",{"$nulls":4},0,"",{"$nulls":4},0,"",{"$nulls":4},0,"",{"$nulls":4},0,"",{"$nulls":4},0,"",{"$nulls":4},0,"",{"$nulls":4},0,"",{"$nulls":4},0,"",{"$nulls":4},0,"",{"$nulls":4},0,"",{"$nulls":4},0,""]
[null,{"$f":"Edital!C21","v":0},{"$nulls":4},0,"",{"$nulls":4},0,"",{"$nulls":4},0,"",{"$nulls":4},0,"",{"$nulls":4},0,"",{"$nulls":4},0,"",{"$nulls":4},0,"",{"$nulls":4},0,"",{"$nulls":4},0,"",{"$nulls":4},0,"",{"$nulls":4},0,"",{"$nulls":4},0,"",{"$nulls":4},0,"",{"$nulls":4},0,"",{"$nulls":4},0,"",{"$nulls":4},0,"",{"$nulls":4},0,"",{"$nulls":4},0,"",{"$nulls":4},0,"",{"$nulls":4},0,""]
[null,{"$f":"Edital!C22","v":0},{"$nulls":4},0,"",{"$nulls":4},0,"",{"$nulls":4},0,"",{"$nulls":4},0,"",{"$nulls":4},0,"",{"$nulls":4},0,"",{"$nulls":4},0,"",{"$nulls":4},0,"",{"$nulls":4},0,"",{"$nulls":4},0,"",{"$nulls":4},0,"",{"$nulls":4},0,"",{"$nulls":4},0,"",{"$nulls":4},0,"",{"$nulls":4},0,"",{"$nulls":4},0,"",{"$nulls":4},0,"",{"$nulls":4},0,"",{"$nulls":4},0,"",{"$nulls":4},0,""]
[null,{"$f":"Edital!C23","v":0},{"$nulls":4},0,"",{"$nulls":4},0,"",{"$nulls":4},0,"",{"$nulls":4},0,"",{"$nulls":4},0,"",{"$nulls":4},0,"",{"$nulls":4},0,"",{"$nulls":4},0,"",{"$nulls":4},0,"",{"$nulls":4},0,"",{"$nulls":4},0,"",{"$nulls":4},0,"",{"$nulls":4},0,"",{"$nulls":4},0,"",{"$nulls":4},0,"",{"$nulls":4},0,"",{"$nulls":4},0,"",{"$nulls":4},0,"",{"$nulls":4},0,"",{"$nulls":4},0,""]
[null,{"$f":"Edital!C24","v":0},{"$nulls":4},0,"",{"$nulls":4},0,"",{"$nulls":4},0,"",{"$nulls":4},0,"",{"$nulls":4},0,"",{"$nulls":4},0,"",{"$nulls":4},0,"",{"$nulls":4},0,"",{"$nulls":4},0,"",{"$nulls":4},0,"",{"$nulls":4},0,"",{"$nulls":4},0,"",{"$nulls":4},0,"",{"$nulls":4},0,"",{"$nulls":4},0,"",{"$nulls":4},0,"",{"$nulls":4},0,"",{"$nulls":4},0,"",{"$nulls":4},0,"",{"$nulls":4},0,""]
[null,{"$f":"Edital!C25","v":0},{"$nulls":4},0,"",{"$nulls":4},0,"",{"$nulls":4},0,"",{"$nulls":4},0,"",{"$nulls":4},0,"",{"$nulls":4},0,"",{"$nulls":4},0,"",{"$nulls":4},0,"",{"$nulls":4},0,"",{"$nulls":4},0,"",{"$nulls":4},0,"",{"$nulls":4},0,"",{"$nulls":4},0,"",{"$nulls":4},0,"",{"$nulls":4},0,"",{"$nulls":4},0,"",{"$nulls":4},0,"",{"$nulls":4},0,"",{"$nulls":4},0,"",{"$nulls":4},0,""]
[null,{"$f":"Edital!C26","v":0},{"$nulls":4},0,"",{"$nulls":4},0,"",{"$nulls":4},0,"",{"$nulls":4},0,"",{"$nulls":4},0,"",{"$nulls":4},0,"",{"$nulls":4},0,"",{"$nulls":4},0,"",{"$nulls":4},0,"",{"$nulls":4},0,"",{"$nulls":4},0,"",{"$nulls":4},0,"",{"$nulls":4},0,"",{"$nulls":4},0,"",{"$nulls":4},0,"",{"$nulls":4},0,"",{"$nulls":4},0,"",{"$nulls":4},0,"",{"$nulls":4},0,"",{"$nulls":4},0,""]
[null,{"$f":"Edital!C27","v":0},{"$nulls":4},0,"",{"$nulls":4},0,"",{"$nulls":4},0,"",{"$nulls":4},0,"",{"$nulls":4},0,"",{"$nulls":4},0,"",{"$nulls":4},0,"",{"$nulls":4},0,"",{"$nulls":4},0,"",{"$nulls":4},0,"",{"$nulls":4},0,"",{"$nulls":4},0,"",{"$nulls":4},0,"",{"$nulls":4},0,"",{"$nulls":4},0,"",{"$nulls":4},0,"",{"$nulls":4},0,"",{"$nulls":4},0,"",{"$nulls":4},0,"",{"$nulls":4},0,""]
[null,{"$f":"Edital!C28","v":0},{"$nulls":4},0,"",{"$nulls":4},0,"",{"$nulls":4},0,"",{"$nulls":4},0,"",{"$nulls":4},0,"",{"$nulls":4},0,"",{"$nulls":4},0,"",{"$nulls":4},0,"",{"$nulls":4},0,"",{"$nulls":4},0,"",{"$nulls":4},0,"",{"$nulls":4},0,"",{"$nulls":4},0,"",{"$nulls":4},0,"",{"$nulls":4},0,"",{"$nulls":4},0,"",{"$nulls":4},0,"",{"$nulls":4},0,"",{"$nulls":4},0,"",{"$nulls":4},0,""]
[null,{"$f":"Edital!C29","v":0},{"$nulls":4},0,"",{"$nulls":4},0,"",{"$nulls":4},0,"",{"$nulls":4},0,"",{"$nulls":4},0,"",{"$nulls":4},0,"",{"$nulls":4},0,"",{"$nulls":4},0,"",{"$nulls":4},0,"",{"$nulls":4},0,"",{"$nulls":4},0,"",{"$nulls":4},0,"",{"$nulls":4},0,"",{"$nulls":4},0,"",{"$nulls":4},0,"",{"$nulls":4},0,"",{"$nulls":4},0,"",{"$nulls":4},0,"",{"$nulls":4},0,"",{"$nulls":4},0,""]
[null,{"$f":"Edital!C30","v":0},{"$nulls":4},0,"",{"$nulls":4},0,"",{"$nulls":4},0,"",{"$nulls":4},0,"",{"$nulls":4},0,"",{"$nulls":4},0,"",{"$nulls":4},0,"",{"$nulls":4},0,"",{"$nulls":4},0,"",{"$nulls":4},0,"",{"$nulls":4},0,"",{"$nulls":4},0,"",{"$nulls":4},0,"",{"$nulls":4},0,"",{"$nulls":4},0,"",{"$nulls":4},0,"",{"$nulls":4},0,"",{"$nulls":4},0,"",{"$nulls":4},0,"",{"$nulls":4},0,""]
[null,{"$f":"Edital!C31","v":0},{"$nulls":4},0,"",{"$nulls":4},0,"",{"$nulls":4},0,"",{"$nulls":4},0,"",{"$nulls":4},0,"",{"$nulls":4},0,"",{"$nulls":4},0,"",{"$nulls":4},0,"",{"$nulls":4},0,"",{"$nulls":4},0,"",{"$nulls":4},0,"",{"$nulls":4},0,"",{"$nulls":4},0,"",{"$nulls":4},0,"",{"$nulls":4},0,"",{"$nulls":4},0,"",{"$nulls":4},0,"",{"$nulls":4},0,"",{"$nulls":4},0,"",{"$nulls":4},0,""]
[null,{"$f":"Edital!C32","v":0},{"$nulls":4},0,"",{"$nulls":4},0,"",{"$nulls":4},0,"",{"$nulls":4},0,"",{"$nulls":4},0,"",{"$nulls":4},0,"",{"$nulls":4},0,"",{"$nulls":4},0,"",{"$nulls":4},0,"",{"$nulls":4},0,"",{"$nulls":4},0,"",{"$nulls":4},0,"",{"$nulls":4},0,"",{"$nulls":4},0,"",{"$nulls":4},0,"",{"$nulls":4},0,"",{"$nulls":4},0,"",{"$nulls":4},0,"",{"$nulls":4},0,"",{"$nulls":4},0,""]
[null,{"$f":"Edital!C33","v":0},{"$nulls":4},0,"",{"$nulls":4},0,"",{"$nulls":4},0,"",{"$nulls":4},0,"",{"$nulls":4},0,"",{"$nulls":4},0,"",{"$nulls":4},0,"",{"$nulls":4},0,"",{"$nulls":4},0,"",{"$nulls":4},0,"",{"$nulls":4},0,"",{"$nulls":4},0,"",{"$nulls":4},0,"",{"$nulls":4},0,"",{"$nulls":4},0,"",{"$nulls":4},0,"",{"$nulls":4},0,"",{"$nulls":4},0,"",{"$nulls":4},0,"",{"$nulls":4},0,""]
[null,{"$f":"Edital!C34","v":0},{"$nulls":4},0,"",{"$nulls":4},0,"",{"$nulls":4},0,"",{"$nulls":4},0,"",{"$nulls":4},0,"",{"$nulls":4},0,"",{"$nulls":4},0,"",{"$nulls":4},0,"",{"$nulls":4},0,"",{"$nulls":4},0,"",{"$nulls":4},0,"",{"$nulls":4},0,"",{"$nulls":4},0,"",{"$nulls":4},0,"",{"$nulls":4},0,"",{"$nulls":4},0,"",{"$nulls":4},0,"",{"$nulls":4},0,"",{"$nulls":4},0,"",{"$nulls":4},0,""]
[null,"Totais",null,{"$f":"SUM(D12:D31)","v":0},{"$f":"SUM(E12:E31)","v":0},{"$f":"SUM(F12:F31)","v":0},{"$f":"SUM(G12:G31)","v":0},null,null,{"$f":"SUM(J12:J31)","v":0},{"$f":"SUM(K12:K31)","v":0},{"$f":"SUM(L12:L31)","v":0},{"$f":"SUM(M12:M31)","v":0},null,null,{"$f":"SUM(P12:P31)","v":0},{"$f":"SUM(Q12:Q31)","v":0},{"$f":"SUM(R12:R31)","v":0},{"$f":"SUM(S12:S31)","v":0},null,null,{"$f":"SUM(V12:V31)","v":0},{"$f":"SUM(W12:W31)","v":0},{"$f":"SUM(X12:X31)","v":0},{"$f":"SUM(Y12:Y31)","v":0},null,null,{"$f":"SUM(AB12:AB31)","v":0},{"$f":"SUM(AC12:AC31)","v":0},{"$f":"SUM(AD12:AD31)","v":0},{"$f":"SUM(AE12:AE31)","v":0},null,null,{"$f":"SUM(AH12:AH31)","v":0},{"$f":"SUM(AI12:AI31)","v":0},{"$f":"SUM(AJ12:AJ31)","v":0},{"$f":"SUM(AK12:AK31)","v":0},null,null,{"$f":"SUM(AN12:AN31)","v":0},{"$f":"SUM(AO12:AO31)","v":0},{"$f":"SUM(AP12:AP31)","v":0},{"$f":"SUM(AQ12:AQ31)","v":0},null,null,{"$f":"SUM(AT12:AT31)","v":0},{"$f":"SUM(AU12:AU31)","v":0},{"$f":"SUM(AV12:AV31)","v":0},{"$f":"SUM(AW12:AW31)","v":0},null,null,{"$f":"SUM(AZ12:AZ31)","v":0},{"$f":"SUM(BA12:BA31)","v":0},{"$f":"SUM(BB12:BB31)","v":0},{"$f":"SUM(BC12:BC31)","v":0},null,null,{"$f":"SUM(BF12:BF31)","v":0},{"$f":"SUM(BG12:BG31)","v":0},{"$f":"SUM(BH12:BH31)","v":0},{"$f":"SUM(BI12:BI31)","v":0},null,null,{"$f":"SUM(BL12:BL31)","v":0},{"$f":"SUM(BM12:BM31)","v":0},{"$f":"SUM(BN12:BN31)","v":0},{"$f":"SUM(BO12:BO31)","v":0},null,null,{"$f":"SUM(BR12:BR31)","v":0},{"$f":"SUM(BS12:BS31)","v":0},{"$f":"SUM(BT12:BT31)","v":0},{"$f":"SUM(BU12:BU31)","v":0},null,null,{"$f":"SUM(BX12:BX31)","v":0},{"$f":"SUM(BY12:BY31)","v":0},{"$f":"SUM(BZ12:BZ31)","v":0},{"$f":"SUM(CA12:CA31)","v":0},null,null,{"$f":"SUM(CD12:CD31)","v":0},{"$f":"SUM(CE12:CE31)","v":0},{"$f":"SUM(CF12:CF31)","v":0},{"$f":"SUM(CG12:CG31)","v":0},null,null,{"$f":"SUM(CJ12:CJ31)","v":0},{"$f":"SUM(CK12:CK31)","v":0},{"$f":"SUM(CL12:CL31)","v":0},{"$f":"SUM(CM12:CM31)","v":0},null,null,{"$f":"SUM(CP12:CP31)","v":0},{"$f":"SUM(CQ12:CQ31)","v":0},{"$f":"SUM(CR12:CR31)","v":0},{"$f":"SUM(CS12:CS31)","v":0},null,null,{"$f":"SUM(CV12:CV31)","v":0},{"$f":"SUM(CW12:CW31)","v":0},{"$f":"SUM(CX12:CX31)","v":0},{"$f":"SUM(CY12:CY31)","v":0},null,null,{"$f":"SUM(DB12:DB31)","v":0},{"$f":"SUM(DC12:DC31)","v":0},{"$f":"SUM(DD12:DD31)","v":0},{"$f":"SUM(DE12:DE31)","v":0},null,null,{"$f":"SUM(DH12:DH31)","v":0},{"$f":"SUM(DI12:DI31)","v":0},{"$f":"SUM(DJ12:DJ31)","v":0},{"$f":"SUM(DK12:DK31)","v":0},null,null,{"$f":"SUM(DN12:DN31)","v":0},{"$f":"SUM(DO12:DO31)","v":0},{"$f":"SUM(DP12:DP31)","v":0},{"$f":"SUM(DQ12:DQ31)","v":0}]
[]
[]
[]
[{"$nulls":3},"M1",{"$f":"IFERROR(E32/D32,\"\")","v":""},{"$nulls":4},"M1",{"$f":"IFERROR(K32/J32,\"\")","v":""},{"$nulls":4},"M1",{"$f":"IFERROR(Q32/P32,\"\")","v":""},{"$nulls":4},"M1",{"$f":"IFERROR(W32/V32,\"\")","v":""},{"$nulls":4},"M1",{"$f":"IFERROR(AC32/AB32,\"\")","v":""},{"$nulls":4},"M1",{"$f":"IFERROR(AI32/AH32,\"\")","v":""},{"$nulls":4},"M1",{"$f":"IFERROR(AO32/AN32,\"\")","v":""},{"$nulls":4},"M1",{"$f":"IFERROR(AU32/AT32,\"\")","v":""},{"$nulls":4},"M1",{"$f":"IFERROR(BA32/AZ32,\"\")","v":""},{"$nulls":4},"M1",{"$f":"IFERROR(BG32/BF32,\"\")","v":""},{"$nulls":4},"M1",{"$f":"IFERROR(BM32/BL32,\"\")","v":""},{"$nulls":4},"M1",{"$f":"IFERROR(BS32/BR32,\"\")","v":""},{"$nulls":4},"M1",{"$f":"IFERROR(BY32/BX32,\"\")","v":""},{"$nulls":4},"M1",{"$f":"IFERROR(CE32/CD32,\"\")","v":""},{"$nulls":4},"M1",{"$f":"IFERROR(CK32/CJ32,\"\")","v":""},{"$nulls":4},"M1",{"$f":"IFERROR(CQ32/CP32,\"\")","v":""},{"$nulls":4},"M1",{"$f":"IFERROR(CW32/CV32,\"\")","v":""},{"$nulls":4},"M1",{"$f":"IFERROR(DC32/DB32,\"\")","v":""},{"$nulls":4},"M1",{"$f":"IFERROR(DI32/DH32,\"\")","v":""},{"$nulls":4},"M1",{"$f":"IFERROR(DO32/DN32,\"\")","v":""}]
[{"$nulls":3},"M2",{"$f":"IFERROR(F37/D32,\"\")","v":""},{"$f":"IFERROR(D32-F32-(G32*2),\"\")","v":0},{"$nulls":3},"M2",{"$f":"IFERROR(L37/J32,\"\")","v":""},{"$f":"IFERROR(J32-L32-(M32*2),\"\")","v":0},{"$nulls":3},"M2",{"$f":"IFERROR(R37/P32,\"\")","v":""},{"$f":"IFERROR(P32-R32-(S32*2),\"\")","v":0},{"$nulls":3},"M2",{"$f":"IFERROR(X37/V32,\"\")","v":""},{"$f":"IFERROR(V32-X32-(Y32*2),\"\")","v":0},{"$nulls":3},"M2",{"$f":"IFERROR(AD37/AB32,\"\")","v":""},{"$f":"IFERROR(AB32-AD32-(AE32*2),\"\")","v":0},{"$nulls":3},"M2",{"$f":"IFERROR(AJ37/AH32,\"\")","v":""},{"$f":"IFERROR(AH32-AJ32-(AK32*2),\"\")","v":0},{"$nulls":3},"M2",{"$f":"IFERROR(AP37/AN32,\"\")","v":""},{"$f":"IFERROR(AN32-AP32-(AQ32*2),\"\")","v":0},{"$nulls":3},"M2",{"$f":"IFERROR(AV37/AT32,\"\")","v":""},{"$f":"IFERROR(AT32-AV32-(AW32*2),\"\")","v":0},{"$nulls":3},"M2",{"$f":"IFERROR(BB37/AZ32,\"\")","v":""},{"$f":"IFERROR(AZ32-BB32-(BC32*2),\"\")","v":0},{"$nulls":3},"M2",{"$f":"IFERROR(BH37/BF32,\"\")","v":""},{"$f":"IFERROR(BF32-BH32-(BI32*2),\"\")","v":0},{"$nulls":3},"M2",{"$f":"IFERROR(BN37/BL32,\"\")","v":""},{"$f":"IFERROR(BL32-BN32-(BO32*2),\"\")","v":0},{"$nulls":3},"M2",{"$f":"IFERROR(BT37/BR32,\"\")","v":""},{"$f":"IFERROR(BR32-BT32-(BU32*2),\"\")","v":0},{"$nulls":3},"M2",{"$f":"IFERROR(BZ37/BX32,\"\")","v":""},{"$f":"IFERROR(BX32-BZ32-(CA32*2),\"\")","v":0},{"$nulls":3},"M2",{"$f":"IFERROR(CF37/CD32,\"\")","v":""},{"$f":"IFERROR(CD32-CF32-(CG32*2),\"\")","v":0},{"$nulls":3},"M2",{"$f":"IFERROR(CL37/CJ32,\"\")","v":""},{"$f":"IFERROR(CJ32-CL32-(CM32*2),\"\")","v":0},{"$nulls":3},"M2",{"$f":"IFERROR(CR37/CP32,\"\")","v":""},{"$f":"IFERROR(CP32-CR32-(CS32*2),\"\")","v":0},{"$nulls":3},"M2",{"$f":"IFERROR(CX37/CV32,\"\")","v":""},{"$f":"IFERROR(CV32-CX32-(CY32*2),\"\")","v":0},{"$nulls":3},"M2",{"$f":"IFERROR(DD37/DB32,\"\")","v":""},{"$f":"IFERROR(DB32-DD32-(DE32*2),\"\")","v":0},{"$nulls":3},"M2",{"$f":"IFERROR(DJ37/DH32,\"\")","v":""},{"$f":"IFERROR(DH32-DJ32-(DK32*2),\"\")","v":0},{"$nulls":3},"M2",{"$f":"IFERROR(DP37/DN32,\"\")","v":""},{"$f":"IFERROR(DN32-DP32-(DQ32*2),\"\")","v":0}]

{"sheet":"Videoaulas","index":8,"n_rows":26,"n_cols":26,"rows_kept":26}
[]
[]
[]
[null,"Legenda","A = Videoaula assistida",{"$nulls":3},"P = Videoaula pendente"]
[]
[null,"Aula",{"$f":"Edital!E15","v":"PORT"},{"$f":"Edital!E16","v":"RLM"},{"$f":"Edital!E17","v":"INFO"},{"$f":"Edital!E18","v":0},{"$f":"Edital!E19","v":0},{"$f":"Edital!E20","v":0},{"$f":"Edital!E21","v":0},{"$f":"Edital!E22","v":0},{"$f":"Edital!E23","v":0},{"$f":"Edital!E24","v":0},{"$f":"Edital!E25","v":0},{"$f":"Edital!E26","v":0},{"$f":"Edital!E27","v":0},{"$f":"Edital!E28","v":0},{"$f":"Edital!E29","v":0},{"$f":"Edital!E30","v":0},{"$f":"Edital!E31","v":0},{"$f":"Edital!E32","v":0},{"$f":"Edital!E33","v":0},{"$f":"Edital!E34","v":0}]
[null,"Aula 01","Sim","Sim","Sim","Sim",{"$nulls":19},{"$f":"COUNTA(C7:V156)","v":36}]
[null,"Aula 02","Sim","Sim","Sim","Não",{"$nulls":19},{"$f":"COUNTIF(C7:V156,\"Sim\")","v":9}]
[null,"Aula 03","Sim","Sim","Não","Não",{"$nulls":19},{"$f":"Z7-Z8","v":27}]
[null,"Aula 04","Não","Não","Não","Não"]
[null,"Aula 05","Não","Não","Não","Não"]
[null,"Aula 06","Não","Não","Não","Não"]
[null,"Aula 07","Não","Não","Não","Não"]
[null,"Aula 08",null,"Não","Não"]
[null,"Aula 09",null,"Não","Não"]
[null,"Aula 10",null,"Não","Não"]
[null,"Aula 11",null,"Não"]
[null,"Aula 12",null,"Não"]
[null,"Aula 13"]
[null,"Aula 14"]
[null,"Aula 15"]
[null,"Aula 16"]
[null,"Aula 17"]
[null,"Aula 18"]
[null,"Aula 19"]
[null,"Aula 20"]

{"sheet":"Leitura","index":9,"n_rows":224,"n_cols":7,"rows_kept":224}
[]
[]
[]
[]
[null,"Matérias","Descrição","Págs","Atual","Progresso","Observações"]
[null,"LÍNGUA PORTUGUESA","PDF ESTRATÉGIA CONCURSOS - AULA 03",180,120,{"$f":"IFERROR(Tabela3[[#This Row],[Atual]]/Tabela3[[#This Row],[Págs]],\"\")","v":{"v":0.6666666666666666,"d":"67%"}}]
[null,"RACIOCÍNIO LÓGICO MATEMÁTICO","LIVRO - SÉRGIO CARVALHO",120,120,{"$f":"IFERROR(Tabela3[[#This Row],[Atual]]/Tabela3[[#This Row],[Págs]],\"\")","v":{"v":1,"d":"100%"}}]
[{"$nulls":5},{"$f":"IFERROR(Tabela3[[#This Row],[Atual]]/Tabela3[[#This Row],[Págs]],\"\")","v":""}]
[{"$nulls":5},{"$f":"IFERROR(Tabela3[[#This Row],[Atual]]/Tabela3[[#This Row],[Págs]],\"\")","v":""}]
[{"$nulls":5},{"$f":"IFERROR(Tabela3[[#This Row],[Atual]]/Tabela3[[#This Row],[Págs]],\"\")","v":""}]
[{"$nulls":5},{"$f":"IFERROR(Tabela3[[#This Row],[Atual]]/Tabela3[[#This Row],[Págs]],\"\")","v":""}]
[{"$nulls":5},{"$f":"IFERROR(Tabela3[[#This Row],[Atual]]/Tabela3[[#This Row],[Págs]],\"\")","v":""}]
[{"$nulls":5},{"$f":"IFERROR(Tabela3[[#This Row],[Atual]]/Tabela3[[#This Row],[Págs]],\"\")","v":""}]
[{"$nulls":5},{"$f":"IFERROR(Tabela3[[#This Row],[Atual]]/Tabela3[[#This Row],[Págs]],\"\")","v":""}]
[{"$nulls":5},{"$f":"IFERROR(Tabela3[[#This Row],[Atual]]/Tabela3[[#This Row],[Págs]],\"\")","v":""}]
[{"$nulls":5},{"$f":"IFERROR(Tabela3[[#This Row],[Atual]]/Tabela3[[#This Row],[Págs]],\"\")","v":""}]
[{"$nulls":5},{"$f":"IFERROR(Tabela3[[#This Row],[Atual]]/Tabela3[[#This Row],[Págs]],\"\")","v":""}]
[{"$nulls":5},{"$f":"IFERROR(Tabela3[[#This Row],[Atual]]/Tabela3[[#This Row],[Págs]],\"\")","v":""}]
[{"$nulls":5},{"$f":"IFERROR(Tabela3[[#This Row],[Atual]]/Tabela3[[#This Row],[Págs]],\"\")","v":""}]
[{"$nulls":5},{"$f":"IFERROR(Tabela3[[#This Row],[Atual]]/Tabela3[[#This Row],[Págs]],\"\")","v":""}]
[{"$nulls":5},{"$f":"IFERROR(Tabela3[[#This Row],[Atual]]/Tabela3[[#This Row],[Págs]],\"\")","v":""}]
[{"$nulls":5},{"$f":"IFERROR(Tabela3[[#This Row],[Atual]]/Tabela3[[#This Row],[Págs]],\"\")","v":""}]
[{"$nulls":5},{"$f":"IFERROR(Tabela3[[#This Row],[Atual]]/Tabela3[[#This Row],[Págs]],\"\")","v":""}]
[{"$nulls":5},{"$f":"IFERROR(Tabela3[[#This Row],[Atual]]/Tabela3[[#This Row],[Págs]],\"\")","v":""}]
[{"$nulls":5},{"$f":"IFERROR(Tabela3[[#This Row],[Atual]]/Tabela3[[#This Row],[Págs]],\"\")","v":""}]
[{"$nulls":5},{"$f":"IFERROR(Tabela3[[#This Row],[Atual]]/Tabela3[[#This Row],[Págs]],\"\")","v":""}]
[{"$nulls":5},{"$f":"IFERROR(Tabela3[[#This Row],[Atual]]/Tabela3[[#This Row],[Págs]],\"\")","v":""}]
[{"$nulls":5},{"$f":"IFERROR(Tabela3[[#This Row],[Atual]]/Tabela3[[#This Row],[Págs]],\"\")","v":""}]
[{"$nulls":5},{"$f":"IFERROR(Tabela3[[#This Row],[Atual]]/Tabela3[[#This Row],[Págs]],\"\")","v":""}]
[{"$nulls":5},{"$f":"IFERROR(Tabela3[[#This Row],[Atual]]/Tabela3[[#This Row],[Págs]],\"\")","v":""}]
[{"$nulls":5},{"$f":"IFERROR(Tabela3[[#This Row],[Atual]]/Tabela3[[#This Row],[Págs]],\"\")","v":""}]
[{"$nulls":5},{"$f":"IFERROR(Tabela3[[#This Row],[Atual]]/Tabela3[[#This Row],[Págs]],\"\")","v":""}]
[{"$nulls":5},{"$f":"IFERROR(Tabela3[[#This Row],[Atual]]/Tabela3[[#This Row],[Págs]],\"\")","v":""}]
[{"$nulls":5},{"$f":"IFERROR(Tabela3[[#This Row],[Atual]]/Tabela3[[#This Row],[Págs]],\"\")","v":""}]
[{"$nulls":5},{"$f":"IFERROR(Tabela3[[#This Row],[Atual]]/Tabela3[[#This Row],[Págs]],\"\")","v":""}]
[{"$nulls":5},{"$f":"IFERROR(Tabela3[[#This Row],[Atual]]/Tabela3[[#This Row],[Págs]],\"\")","v":""}]
[{"$nulls":5},{"$f":"IFERROR(Tabela3[[#This Row],[Atual]]/Tabela3[[#This Row],[Págs]],\"\")","v":""}]
[{"$nulls":5},{"$f":"IFERROR(Tabela3[[#This Row],[Atual]]/Tabela3[[#This Row],[Págs]],\"\")","v":""}]
[{"$nulls":5},{"$f":"IFERROR(Tabela3[[#This Row],[Atual]]/Tabela3[[#This Row],[Págs]],\"\")","v":""}]
[{"$nulls":5},{"$f":"IFERROR(Tabela3[[#This Row],[Atual]]/Tabela3[[#This Row],[Págs]],\"\")","v":""}]
[{"$nulls":5},{"$f":"IFERROR(Tabela3[[#This Row],[Atual]]/Tabela3[[#This Row],[Págs]],\"\")","v":""}]
[{"$nulls":5},{"$f":"IFERROR(Tabela3[[#This Row],[Atual]]/Tabela3[[#This Row],[Págs]],\"\")","v":""}]
[{"$nulls":5},{"$f":"IFERROR(Tabela3[[#This Row],[Atual]]/Tabela3[[#This Row],[Págs]],\"\")","v":""}]
[{"$nulls":5},{"$f":"IFERROR(Tabela3[[#This Row],[Atual]]/Tabela3[[#This Row],[Págs]],\"\")","v":""}]
[{"$nulls":5},{"$f":"IFERROR(Tabela3[[#This Row],[Atual]]/Tabela3[[#This Row],[Págs]],\"\")","v":""}]
[{"$nulls":5},{"$f":"IFERROR(Tabela3[[#This Row],[Atual]]/Tabela3[[#This Row],[Págs]],\"\")","v":""}]
[{"$nulls":5},{"$f":"IFERROR(Tabela3[[#This Row],[Atual]]/Tabela3[[#This Row],[Págs]],\"\")","v":""}]
[{"$nulls":5},{"$f":"IFERROR(Tabela3[[#This Row],[Atual]]/Tabela3[[#This Row],[Págs]],\"\")","v":""}]
[{"$nulls":5},{"$f":"IFERROR(Tabela3[[#This Row],[Atual]]/Tabela3[[#This Row],[Págs]],\"\")","v":""}]
[{"$nulls":5},{"$f":"IFERROR(Tabela3[[#This Row],[Atual]]/Tabela3[[#This Row],[Págs]],\"\")","v":""}]
[{"$nulls":5},{"$f":"IFERROR(Tabela3[[#This Row],[Atual]]/Tabela3[[#This Row],[Págs]],\"\")","v":""}]
[{"$nulls":5},{"$f":"IFERROR(Tabela3[[#This Row],[Atual]]/Tabela3[[#This Row],[Págs]],\"\")","v":""}]
[{"$nulls":5},{"$f":"IFERROR(Tabela3[[#This Row],[Atual]]/Tabela3[[#This Row],[Págs]],\"\")","v":""}]
[{"$nulls":5},{"$f":"IFERROR(Tabela3[[#This Row],[Atual]]/Tabela3[[#This Row],[Págs]],\"\")","v":""}]
[{"$nulls":5},{"$f":"IFERROR(Tabela3[[#This Row],[Atual]]/Tabela3[[#This Row],[Págs]],\"\")","v":""}]
[{"$nulls":5},{"$f":"IFERROR(Tabela3[[#This Row],[Atual]]/Tabela3[[#This Row],[Págs]],\"\")","v":""}]
[{"$nulls":5},{"$f":"IFERROR(Tabela3[[#This Row],[Atual]]/Tabela3[[#This Row],[Págs]],\"\")","v":""}]
[{"$nulls":5},{"$f":"IFERROR(Tabela3[[#This Row],[Atual]]/Tabela3[[#This Row],[Págs]],\"\")","v":""}]
[{"$nulls":5},{"$f":"IFERROR(Tabela3[[#This Row],[Atual]]/Tabela3[[#This Row],[Págs]],\"\")","v":""}]
[{"$nulls":5},{"$f":"IFERROR(Tabela3[[#This Row],[Atual]]/Tabela3[[#This Row],[Págs]],\"\")","v":""}]
[{"$nulls":5},{"$f":"IFERROR(Tabela3[[#This Row],[Atual]]/Tabela3[[#This Row],[Págs]],\"\")","v":""}]
[{"$nulls":5},{"$f":"IFERROR(Tabela3[[#This Row],[Atual]]/Tabela3[[#This Row],[Págs]],\"\")","v":""}]
[{"$nulls":5},{"$f":"IFERROR(Tabela3[[#This Row],[Atual]]/Tabela3[[#This Row],[Págs]],\"\")","v":""}]
[{"$nulls":5},{"$f":"IFERROR(Tabela3[[#This Row],[Atual]]/Tabela3[[#This Row],[Págs]],\"\")","v":""}]
[{"$nulls":5},{"$f":"IFERROR(Tabela3[[#This Row],[Atual]]/Tabela3[[#This Row],[Págs]],\"\")","v":""}]
[{"$nulls":5},{"$f":"IFERROR(Tabela3[[#This Row],[Atual]]/Tabela3[[#This Row],[Págs]],\"\")","v":""}]
[{"$nulls":5},{"$f":"IFERROR(Tabela3[[#This Row],[Atual]]/Tabela3[[#This Row],[Págs]],\"\")","v":""}]
[{"$nulls":5},{"$f":"IFERROR(Tabela3[[#This Row],[Atual]]/Tabela3[[#This Row],[Págs]],\"\")","v":""}]
[{"$nulls":5},{"$f":"IFERROR(Tabela3[[#This Row],[Atual]]/Tabela3[[#This Row],[Págs]],\"\")","v":""}]
[{"$nulls":5},{"$f":"IFERROR(Tabela3[[#This Row],[Atual]]/Tabela3[[#This Row],[Págs]],\"\")","v":""}]
[{"$nulls":5},{"$f":"IFERROR(Tabela3[[#This Row],[Atual]]/Tabela3[[#This Row],[Págs]],\"\")","v":""}]
[{"$nulls":5},{"$f":"IFERROR(Tabela3[[#This Row],[Atual]]/Tabela3[[#This Row],[Págs]],\"\")","v":""}]
[{"$nulls":5},{"$f":"IFERROR(Tabela3[[#This Row],[Atual]]/Tabela3[[#This Row],[Págs]],\"\")","v":""}]
[{"$nulls":5},{"$f":"IFERROR(Tabela3[[#This Row],[Atual]]/Tabela3[[#This Row],[Págs]],\"\")","v":""}]
[{"$nulls":5},{"$f":"IFERROR(Tabela3[[#This Row],[Atual]]/Tabela3[[#This Row],[Págs]],\"\")","v":""}]
[{"$nulls":5},{"$f":"IFERROR(Tabela3[[#This Row],[Atual]]/Tabela3[[#This Row],[Págs]],\"\")","v":""}]
[{"$nulls":5},{"$f":"IFERROR(Tabela3[[#This Row],[Atual]]/Tabela3[[#This Row],[Págs]],\"\")","v":""}]
[{"$nulls":5},{"$f":"IFERROR(Tabela3[[#This Row],[Atual]]/Tabela3[[#This Row],[Págs]],\"\")","v":""}]
[{"$nulls":5},{"$f":"IFERROR(Tabela3[[#This Row],[Atual]]/Tabela3[[#This Row],[Págs]],\"\")","v":""}]
[{"$nulls":5},{"$f":"IFERROR(Tabela3[[#This Row],[Atual]]/Tabela3[[#This Row],[Págs]],\"\")","v":""}]
[{"$nulls":5},{"$f":"IFERROR(Tabela3[[#This Row],[Atual]]/Tabela3[[#This Row],[Págs]],\"\")","v":""}]
[{"$nulls":5},{"$f":"IFERROR(Tabela3[[#This Row],[Atual]]/Tabela3[[#This Row],[Págs]],\"\")","v":""}]
[{"$nulls":5},{"$f":"IFERROR(Tabela3[[#This Row],[Atual]]/Tabela3[[#This Row],[Págs]],\"\")","v":""}]
[{"$nulls":5},{"$f":"IFERROR(Tabela3[[#This Row],[Atual]]/Tabela3[[#This Row],[Págs]],\"\")","v":""}]
[{"$nulls":5},{"$f":"IFERROR(Tabela3[[#This Row],[Atual]]/Tabela3[[#This Row],[Págs]],\"\")","v":""}]
[{"$nulls":5},{"$f":"IFERROR(Tabela3[[#This Row],[Atual]]/Tabela3[[#This Row],[Págs]],\"\")","v":""}]
[{"$nulls":5},{"$f":"IFERROR(Tabela3[[#This Row],[Atual]]/Tabela3[[#This Row],[Págs]],\"\")","v":""}]
[{"$nulls":5},{"$f":"IFERROR(Tabela3[[#This Row],[Atual]]/Tabela3[[#This Row],[Págs]],\"\")","v":""}]
[{"$nulls":5},{"$f":"IFERROR(Tabela3[[#This Row],[Atual]]/Tabela3[[#This Row],[Págs]],\"\")","v":""}]
[{"$nulls":5},{"$f":"IFERROR(Tabela3[[#This Row],[Atual]]/Tabela3[[#This Row],[Págs]],\"\")","v":""}]
[{"$nulls":5},{"$f":"IFERROR(Tabela3[[#This Row],[Atual]]/Tabela3[[#This Row],[Págs]],\"\")","v":""}]
[{"$nulls":5},{"$f":"IFERROR(Tabela3[[#This Row],[Atual]]/Tabela3[[#This Row],[Págs]],\"\")","v":""}]
[{"$nulls":5},{"$f":"IFERROR(Tabela3[[#This Row],[Atual]]/Tabela3[[#This Row],[Págs]],\"\")","v":""}]
[{"$nulls":5},{"$f":"IFERROR(Tabela3[[#This Row],[Atual]]/Tabela3[[#This Row],[Págs]],\"\")","v":""}]
[{"$nulls":5},{"$f":"IFERROR(Tabela3[[#This Row],[Atual]]/Tabela3[[#This Row],[Págs]],\"\")","v":""}]
[{"$nulls":5},{"$f":"IFERROR(Tabela3[[#This Row],[Atual]]/Tabela3[[#This Row],[Págs]],\"\")","v":""}]
[{"$nulls":5},{"$f":"IFERROR(Tabela3[[#This Row],[Atual]]/Tabela3[[#This Row],[Págs]],\"\")","v":""}]
[{"$nulls":5},{"$f":"IFERROR(Tabela3[[#This Row],[Atual]]/Tabela3[[#This Row],[Págs]],\"\")","v":""}]
[{"$nulls":5},{"$f":"IFERROR(Tabela3[[#This Row],[Atual]]/Tabela3[[#This Row],[Págs]],\"\")","v":""}]
[{"$nulls":5},{"$f":"IFERROR(Tabela3[[#This Row],[Atual]]/Tabela3[[#This Row],[Págs]],\"\")","v":""}]
[{"$nulls":5},{"$f":"IFERROR(Tabela3[[#This Row],[Atual]]/Tabela3[[#This Row],[Págs]],\"\")","v":""}]
[{"$nulls":5},{"$f":"IFERROR(Tabela3[[#This Row],[Atual]]/Tabela3[[#This Row],[Págs]],\"\")","v":""}]
[{"$nulls":5},{"$f":"IFERROR(Tabela3[[#This Row],[Atual]]/Tabela3[[#This Row],[Págs]],\"\")","v":""}]
[{"$nulls":5},{"$f":"IFERROR(Tabela3[[#This Row],[Atual]]/Tabela3[[#This Row],[Págs]],\"\")","v":""}]
[{"$nulls":5},{"$f":"IFERROR(Tabela3[[#This Row],[Atual]]/Tabela3[[#This Row],[Págs]],\"\")","v":""}]
[{"$nulls":5},{"$f":"IFERROR(Tabela3[[#This Row],[Atual]]/Tabela3[[#This Row],[Págs]],\"\")","v":""}]
[{"$nulls":5},{"$f":"IFERROR(Tabela3[[#This Row],[Atual]]/Tabela3[[#This Row],[Págs]],\"\")","v":""}]
[{"$nulls":5},{"$f":"IFERROR(Tabela3[[#This Row],[Atual]]/Tabela3[[#This Row],[Págs]],\"\")","v":""}]
[{"$nulls":5},{"$f":"IFERROR(Tabela3[[#This Row],[Atual]]/Tabela3[[#This Row],[Págs]],\"\")","v":""}]
[{"$nulls":5},{"$f":"IFERROR(Tabela3[[#This Row],[Atual]]/Tabela3[[#This Row],[Págs]],\"\")","v":""}]
[{"$nulls":5},{"$f":"IFERROR(Tabela3[[#This Row],[Atual]]/Tabela3[[#This Row],[Págs]],\"\")","v":""}]
[{"$nulls":5},{"$f":"IFERROR(Tabela3[[#This Row],[Atual]]/Tabela3[[#This Row],[Págs]],\"\")","v":""}]
[{"$nulls":5},{"$f":"IFERROR(Tabela3[[#This Row],[Atual]]/Tabela3[[#This Row],[Págs]],\"\")","v":""}]
[{"$nulls":5},{"$f":"IFERROR(Tabela3[[#This Row],[Atual]]/Tabela3[[#This Row],[Págs]],\"\")","v":""}]
[{"$nulls":5},{"$f":"IFERROR(Tabela3[[#This Row],[Atual]]/Tabela3[[#This Row],[Págs]],\"\")","v":""}]
[{"$nulls":5},{"$f":"IFERROR(Tabela3[[#This Row],[Atual]]/Tabela3[[#This Row],[Págs]],\"\")","v":""}]
[{"$nulls":5},{"$f":"IFERROR(Tabela3[[#This Row],[Atual]]/Tabela3[[#This Row],[Págs]],\"\")","v":""}]
[{"$nulls":5},{"$f":"IFERROR(Tabela3[[#This Row],[Atual]]/Tabela3[[#This Row],[Págs]],\"\")","v":""}]
[{"$nulls":5},{"$f":"IFERROR(Tabela3[[#This Row],[Atual]]/Tabela3[[#This Row],[Págs]],\"\")","v":""}]
[{"$nulls":5},{"$f":"IFERROR(Tabela3[[#This Row],[Atual]]/Tabela3[[#This Row],[Págs]],\"\")","v":""}]
[{"$nulls":5},{"$f":"IFERROR(Tabela3[[#This Row],[Atual]]/Tabela3[[#This Row],[Págs]],\"\")","v":""}]
[{"$nulls":5},{"$f":"IFERROR(Tabela3[[#This Row],[Atual]]/Tabela3[[#This Row],[Págs]],\"\")","v":""}]
[{"$nulls":5},{"$f":"IFERROR(Tabela3[[#This Row],[Atual]]/Tabela3[[#This Row],[Págs]],\"\")","v":""}]
[{"$nulls":5},{"$f":"IFERROR(Tabela3[[#This Row],[Atual]]/Tabela3[[#This Row],[Págs]],\"\")","v":""}]
[{"$nulls":5},{"$f":"IFERROR(Tabela3[[#This Row],[Atual]]/Tabela3[[#This Row],[Págs]],\"\")","v":""}]
[{"$nulls":5},{"$f":"IFERROR(Tabela3[[#This Row],[Atual]]/Tabela3[[#This Row],[Págs]],\"\")","v":""}]
[{"$nulls":5},{"$f":"IFERROR(Tabela3[[#This Row],[Atual]]/Tabela3[[#This Row],[Págs]],\"\")","v":""}]
[{"$nulls":5},{"$f":"IFERROR(Tabela3[[#This Row],[Atual]]/Tabela3[[#This Row],[Págs]],\"\")","v":""}]
[{"$nulls":5},{"$f":"IFERROR(Tabela3[[#This Row],[Atual]]/Tabela3[[#This Row],[Págs]],\"\")","v":""}]
[{"$nulls":5},{"$f":"IFERROR(Tabela3[[#This Row],[Atual]]/Tabela3[[#This Row],[Págs]],\"\")","v":""}]
[{"$nulls":5},{"$f":"IFERROR(Tabela3[[#This Row],[Atual]]/Tabela3[[#This Row],[Págs]],\"\")","v":""}]
[{"$nulls":5},{"$f":"IFERROR(Tabela3[[#This Row],[Atual]]/Tabela3[[#This Row],[Págs]],\"\")","v":""}]
[{"$nulls":5},{"$f":"IFERROR(Tabela3[[#This Row],[Atual]]/Tabela3[[#This Row],[Págs]],\"\")","v":""}]
[{"$nulls":5},{"$f":"IFERROR(Tabela3[[#This Row],[Atual]]/Tabela3[[#This Row],[Págs]],\"\")","v":""}]
[{"$nulls":5},{"$f":"IFERROR(Tabela3[[#This Row],[Atual]]/Tabela3[[#This Row],[Págs]],\"\")","v":""}]
[{"$nulls":5},{"$f":"IFERROR(Tabela3[[#This Row],[Atual]]/Tabela3[[#This Row],[Págs]],\"\")","v":""}]
[{"$nulls":5},{"$f":"IFERROR(Tabela3[[#This Row],[Atual]]/Tabela3[[#This Row],[Págs]],\"\")","v":""}]
[{"$nulls":5},{"$f":"IFERROR(Tabela3[[#This Row],[Atual]]/Tabela3[[#This Row],[Págs]],\"\")","v":""}]
[{"$nulls":5},{"$f":"IFERROR(Tabela3[[#This Row],[Atual]]/Tabela3[[#This Row],[Págs]],\"\")","v":""}]
[{"$nulls":5},{"$f":"IFERROR(Tabela3[[#This Row],[Atual]]/Tabela3[[#This Row],[Págs]],\"\")","v":""}]
[{"$nulls":5},{"$f":"IFERROR(Tabela3[[#This Row],[Atual]]/Tabela3[[#This Row],[Págs]],\"\")","v":""}]
[{"$nulls":5},{"$f":"IFERROR(Tabela3[[#This Row],[Atual]]/Tabela3[[#This Row],[Págs]],\"\")","v":""}]
[{"$nulls":5},{"$f":"IFERROR(Tabela3[[#This Row],[Atual]]/Tabela3[[#This Row],[Págs]],\"\")","v":""}]
[{"$nulls":5},{"$f":"IFERROR(Tabela3[[#This Row],[Atual]]/Tabela3[[#This Row],[Págs]],\"\")","v":""}]
[{"$nulls":5},{"$f":"IFERROR(Tabela3[[#This Row],[Atual]]/Tabela3[[#This Row],[Págs]],\"\")","v":""}]
[{"$nulls":5},{"$f":"IFERROR(Tabela3[[#This Row],[Atual]]/Tabela3[[#This Row],[Págs]],\"\")","v":""}]
[{"$nulls":5},{"$f":"IFERROR(Tabela3[[#This Row],[Atual]]/Tabela3[[#This Row],[Págs]],\"\")","v":""}]
[{"$nulls":5},{"$f":"IFERROR(Tabela3[[#This Row],[Atual]]/Tabela3[[#This Row],[Págs]],\"\")","v":""}]
[{"$nulls":5},{"$f":"IFERROR(Tabela3[[#This Row],[Atual]]/Tabela3[[#This Row],[Págs]],\"\")","v":""}]
[{"$nulls":5},{"$f":"IFERROR(Tabela3[[#This Row],[Atual]]/Tabela3[[#This Row],[Págs]],\"\")","v":""}]
[{"$nulls":5},{"$f":"IFERROR(Tabela3[[#This Row],[Atual]]/Tabela3[[#This Row],[Págs]],\"\")","v":""}]
[{"$nulls":5},{"$f":"IFERROR(Tabela3[[#This Row],[Atual]]/Tabela3[[#This Row],[Págs]],\"\")","v":""}]
[{"$nulls":5},{"$f":"IFERROR(Tabela3[[#This Row],[Atual]]/Tabela3[[#This Row],[Págs]],\"\")","v":""}]
[{"$nulls":5},{"$f":"IFERROR(Tabela3[[#This Row],[Atual]]/Tabela3[[#This Row],[Págs]],\"\")","v":""}]
[{"$nulls":5},{"$f":"IFERROR(Tabela3[[#This Row],[Atual]]/Tabela3[[#This Row],[Págs]],\"\")","v":""}]
[{"$nulls":5},{"$f":"IFERROR(Tabela3[[#This Row],[Atual]]/Tabela3[[#This Row],[Págs]],\"\")","v":""}]
[{"$nulls":5},{"$f":"IFERROR(Tabela3[[#This Row],[Atual]]/Tabela3[[#This Row],[Págs]],\"\")","v":""}]
[{"$nulls":5},{"$f":"IFERROR(Tabela3[[#This Row],[Atual]]/Tabela3[[#This Row],[Págs]],\"\")","v":""}]
[{"$nulls":5},{"$f":"IFERROR(Tabela3[[#This Row],[Atual]]/Tabela3[[#This Row],[Págs]],\"\")","v":""}]
[{"$nulls":5},{"$f":"IFERROR(Tabela3[[#This Row],[Atual]]/Tabela3[[#This Row],[Págs]],\"\")","v":""}]
[{"$nulls":5},{"$f":"IFERROR(Tabela3[[#This Row],[Atual]]/Tabela3[[#This Row],[Págs]],\"\")","v":""}]
[{"$nulls":5},{"$f":"IFERROR(Tabela3[[#This Row],[Atual]]/Tabela3[[#This Row],[Págs]],\"\")","v":""}]
[{"$nulls":5},{"$f":"IFERROR(Tabela3[[#This Row],[Atual]]/Tabela3[[#This Row],[Págs]],\"\")","v":""}]
[{"$nulls":5},{"$f":"IFERROR(Tabela3[[#This Row],[Atual]]/Tabela3[[#This Row],[Págs]],\"\")","v":""}]
[{"$nulls":5},{"$f":"IFERROR(Tabela3[[#This Row],[Atual]]/Tabela3[[#This Row],[Págs]],\"\")","v":""}]
[{"$nulls":5},{"$f":"IFERROR(Tabela3[[#This Row],[Atual]]/Tabela3[[#This Row],[Págs]],\"\")","v":""}]
[{"$nulls":5},{"$f":"IFERROR(Tabela3[[#This Row],[Atual]]/Tabela3[[#This Row],[Págs]],\"\")","v":""}]
[{"$nulls":5},{"$f":"IFERROR(Tabela3[[#This Row],[Atual]]/Tabela3[[#This Row],[Págs]],\"\")","v":""}]
[{"$nulls":5},{"$f":"IFERROR(Tabela3[[#This Row],[Atual]]/Tabela3[[#This Row],[Págs]],\"\")","v":""}]
[{"$nulls":5},{"$f":"IFERROR(Tabela3[[#This Row],[Atual]]/Tabela3[[#This Row],[Págs]],\"\")","v":""}]
[{"$nulls":5},{"$f":"IFERROR(Tabela3[[#This Row],[Atual]]/Tabela3[[#This Row],[Págs]],\"\")","v":""}]
[{"$nulls":5},{"$f":"IFERROR(Tabela3[[#This Row],[Atual]]/Tabela3[[#This Row],[Págs]],\"\")","v":""}]
[{"$nulls":5},{"$f":"IFERROR(Tabela3[[#This Row],[Atual]]/Tabela3[[#This Row],[Págs]],\"\")","v":""}]
[{"$nulls":5},{"$f":"IFERROR(Tabela3[[#This Row],[Atual]]/Tabela3[[#This Row],[Págs]],\"\")","v":""}]
[{"$nulls":5},{"$f":"IFERROR(Tabela3[[#This Row],[Atual]]/Tabela3[[#This Row],[Págs]],\"\")","v":""}]
[{"$nulls":5},{"$f":"IFERROR(Tabela3[[#This Row],[Atual]]/Tabela3[[#This Row],[Págs]],\"\")","v":""}]
[{"$nulls":5},{"$f":"IFERROR(Tabela3[[#This Row],[Atual]]/Tabela3[[#This Row],[Págs]],\"\")","v":""}]
[{"$nulls":5},{"$f":"IFERROR(Tabela3[[#This Row],[Atual]]/Tabela3[[#This Row],[Págs]],\"\")","v":""}]
[{"$nulls":5},{"$f":"IFERROR(Tabela3[[#This Row],[Atual]]/Tabela3[[#This Row],[Págs]],\"\")","v":""}]
[{"$nulls":5},{"$f":"IFERROR(Tabela3[[#This Row],[Atual]]/Tabela3[[#This Row],[Págs]],\"\")","v":""}]
[{"$nulls":5},{"$f":"IFERROR(Tabela3[[#This Row],[Atual]]/Tabela3[[#This Row],[Págs]],\"\")","v":""}]
[{"$nulls":5},{"$f":"IFERROR(Tabela3[[#This Row],[Atual]]/Tabela3[[#This Row],[Págs]],\"\")","v":""}]
[{"$nulls":5},{"$f":"IFERROR(Tabela3[[#This Row],[Atual]]/Tabela3[[#This Row],[Págs]],\"\")","v":""}]
[{"$nulls":5},{"$f":"IFERROR(Tabela3[[#This Row],[Atual]]/Tabela3[[#This Row],[Págs]],\"\")","v":""}]
[{"$nulls":5},{"$f":"IFERROR(Tabela3[[#This Row],[Atual]]/Tabela3[[#This Row],[Págs]],\"\")","v":""}]
[{"$nulls":5},{"$f":"IFERROR(Tabela3[[#This Row],[Atual]]/Tabela3[[#This Row],[Págs]],\"\")","v":""}]
[{"$nulls":5},{"$f":"IFERROR(Tabela3[[#This Row],[Atual]]/Tabela3[[#This Row],[Págs]],\"\")","v":""}]
[{"$nulls":5},{"$f":"IFERROR(Tabela3[[#This Row],[Atual]]/Tabela3[[#This Row],[Págs]],\"\")","v":""}]
[{"$nulls":5},{"$f":"IFERROR(Tabela3[[#This Row],[Atual]]/Tabela3[[#This Row],[Págs]],\"\")","v":""}]
[{"$nulls":5},{"$f":"IFERROR(Tabela3[[#This Row],[Atual]]/Tabela3[[#This Row],[Págs]],\"\")","v":""}]
[{"$nulls":5},{"$f":"IFERROR(Tabela3[[#This Row],[Atual]]/Tabela3[[#This Row],[Págs]],\"\")","v":""}]
[{"$nulls":5},{"$f":"IFERROR(Tabela3[[#This Row],[Atual]]/Tabela3[[#This Row],[Págs]],\"\")","v":""}]
[{"$nulls":5},{"$f":"IFERROR(Tabela3[[#This Row],[Atual]]/Tabela3[[#This Row],[Págs]],\"\")","v":""}]
[{"$nulls":5},{"$f":"IFERROR(Tabela3[[#This Row],[Atual]]/Tabela3[[#This Row],[Págs]],\"\")","v":""}]
[{"$nulls":5},{"$f":"IFERROR(Tabela3[[#This Row],[Atual]]/Tabela3[[#This Row],[Págs]],\"\")","v":""}]
[{"$nulls":5},{"$f":"IFERROR(Tabela3[[#This Row],[Atual]]/Tabela3[[#This Row],[Págs]],\"\")","v":""}]
[{"$nulls":5},{"$f":"IFERROR(Tabela3[[#This Row],[Atual]]/Tabela3[[#This Row],[Págs]],\"\")","v":""}]
[{"$nulls":5},{"$f":"IFERROR(Tabela3[[#This Row],[Atual]]/Tabela3[[#This Row],[Págs]],\"\")","v":""}]
[{"$nulls":5},{"$f":"IFERROR(Tabela3[[#This Row],[Atual]]/Tabela3[[#This Row],[Págs]],\"\")","v":""}]
[{"$nulls":5},{"$f":"IFERROR(Tabela3[[#This Row],[Atual]]/Tabela3[[#This Row],[Págs]],\"\")","v":""}]
[{"$nulls":5},{"$f":"IFERROR(Tabela3[[#This Row],[Atual]]/Tabela3[[#This Row],[Págs]],\"\")","v":""}]
[{"$nulls":5},{"$f":"IFERROR(Tabela3[[#This Row],[Atual]]/Tabela3[[#This Row],[Págs]],\"\")","v":""}]
[{"$nulls":5},{"$f":"IFERROR(Tabela3[[#This Row],[Atual]]/Tabela3[[#This Row],[Págs]],\"\")","v":""}]
[{"$nulls":5},{"$f":"IFERROR(Tabela3[[#This Row],[Atual]]/Tabela3[[#This Row],[Págs]],\"\")","v":""}]
[{"$nulls":5},{"$f":"IFERROR(Tabela3[[#This Row],[Atual]]/Tabela3[[#This Row],[Págs]],\"\")","v":""}]
[{"$nulls":5},{"$f":"IFERROR(Tabela3[[#This Row],[Atual]]/Tabela3[[#This Row],[Págs]],\"\")","v":""}]
[{"$nulls":5},{"$f":"IFERROR(Tabela3[[#This Row],[Atual]]/Tabela3[[#This Row],[Págs]],\"\")","v":""}]
[{"$nulls":5},{"$f":"IFERROR(Tabela3[[#This Row],[Atual]]/Tabela3[[#This Row],[Págs]],\"\")","v":""}]
[{"$nulls":5},{"$f":"IFERROR(Tabela3[[#This Row],[Atual]]/Tabela3[[#This Row],[Págs]],\"\")","v":""}]
[{"$nulls":5},{"$f":"IFERROR(Tabela3[[#This Row],[Atual]]/Tabela3[[#This Row],[Págs]],\"\")","v":""}]
[{"$nulls":5},{"$f":"IFERROR(Tabela3[[#This Row],[Atual]]/Tabela3[[#This Row],[Págs]],\"\")","v":""}]
[{"$nulls":5},{"$f":"IFERROR(Tabela3[[#This Row],[Atual]]/Tabela3[[#This Row],[Págs]],\"\")","v":""}]
[{"$nulls":5},{"$f":"IFERROR(Tabela3[[#This Row],[Atual]]/Tabela3[[#This Row],[Págs]],\"\")","v":""}]
[{"$nulls":5},{"$f":"IFERROR(Tabela3[[#This Row],[Atual]]/Tabela3[[#This Row],[Págs]],\"\")","v":""}]
[{"$nulls":5},{"$f":"IFERROR(Tabela3[[#This Row],[Atual]]/Tabela3[[#This Row],[Págs]],\"\")","v":""}]
[{"$nulls":5},{"$f":"IFERROR(Tabela3[[#This Row],[Atual]]/Tabela3[[#This Row],[Págs]],\"\")","v":""}]
[{"$nulls":5},{"$f":"IFERROR(Tabela3[[#This Row],[Atual]]/Tabela3[[#This Row],[Págs]],\"\")","v":""}]
[{"$nulls":5},{"$f":"IFERROR(Tabela3[[#This Row],[Atual]]/Tabela3[[#This Row],[Págs]],\"\")","v":""}]
[{"$nulls":5},{"$f":"IFERROR(Tabela3[[#This Row],[Atual]]/Tabela3[[#This Row],[Págs]],\"\")","v":""}]
[{"$nulls":5},{"$f":"IFERROR(Tabela3[[#This Row],[Atual]]/Tabela3[[#This Row],[Págs]],\"\")","v":""}]
[{"$nulls":5},{"$f":"IFERROR(Tabela3[[#This Row],[Atual]]/Tabela3[[#This Row],[Págs]],\"\")","v":""}]
[{"$nulls":5},{"$f":"IFERROR(Tabela3[[#This Row],[Atual]]/Tabela3[[#This Row],[Págs]],\"\")","v":""}]
[{"$nulls":5},{"$f":"IFERROR(Tabela3[[#This Row],[Atual]]/Tabela3[[#This Row],[Págs]],\"\")","v":""}]
[{"$nulls":5},{"$f":"IFERROR(Tabela3[[#This Row],[Atual]]/Tabela3[[#This Row],[Págs]],\"\")","v":""}]

{"sheet":"ConcursosPrevistos","index":10,"n_rows":8,"n_cols":7,"rows_kept":8}
[]
[]
[]
[]
[null,"Concurso","Área","Data prevista*","Banca prevista*","Probabilidade","Minhas anotações"]
[null,"TJSP","JUDICIÁRIO","2019","VUNESP","Alta"]
[null,"ICMS","FISCAL","2019","ESAF","Média"]
[null,"RFB","FISCAL","2019","ESAF","Baixa"]

{"sheet":"ConcursosRealizados","index":11,"n_rows":57,"n_cols":10,"rows_kept":57}
[]
[]
[]
[{"$nulls":8},{"$f":"COUNTIF(F8:F10,\"Aprovado\")","v":2},{"$f":"I4&\"/\"&I5","v":"2/0"}]
[{"$nulls":8},{"$f":"COUNTIF(F8:F10,\"Reprovado\")","v":0}]
[]
[null,"Concurso","Data da prova","Banca","Anotações","Status"]
[null,"TJSP - ESCREVENTE","2018-03-20","VUNESP","AGUARDANDO NOMEAÇÃO","Aprovado",{"$f":"IF(F8=\"Aprovado\",\"2\",IF(F8=\"Reprovado\",\"1\",\"0\"))","v":"2"}]
[null,"MPU",null,"CESPE","FORA DAS VAGAS","Aprovado",{"$f":"IF(F9=\"Aprovado\",\"2\",IF(F9=\"Reprovado\",\"1\",\"0\"))","v":"2"}]
[{"$nulls":6},{"$f":"IF(F10=\"Aprovado\",\"2\",IF(F10=\"Reprovado\",\"1\",\"0\"))","v":"0"}]
[null,{"$f":"IF(#REF!=\"Aprovado\",\"2\",IF(#REF!=\"Reprovado\",\"1\",\"0\"))","v":{"$error":"#REF!"}}]
[null,{"$f":"IF(#REF!=\"Aprovado\",\"2\",IF(#REF!=\"Reprovado\",\"1\",\"0\"))","v":{"$error":"#REF!"}}]
[null,{"$f":"IF(#REF!=\"Aprovado\",\"2\",IF(#REF!=\"Reprovado\",\"1\",\"0\"))","v":{"$error":"#REF!"}}]
[null,{"$f":"IF(#REF!=\"Aprovado\",\"2\",IF(#REF!=\"Reprovado\",\"1\",\"0\"))","v":{"$error":"#REF!"}}]
[null,{"$f":"IF(#REF!=\"Aprovado\",\"2\",IF(#REF!=\"Reprovado\",\"1\",\"0\"))","v":{"$error":"#REF!"}}]
[null,{"$f":"IF(#REF!=\"Aprovado\",\"2\",IF(#REF!=\"Reprovado\",\"1\",\"0\"))","v":{"$error":"#REF!"}}]
[null,{"$f":"IF(#REF!=\"Aprovado\",\"2\",IF(#REF!=\"Reprovado\",\"1\",\"0\"))","v":{"$error":"#REF!"}}]
[null,{"$f":"IF(#REF!=\"Aprovado\",\"2\",IF(#REF!=\"Reprovado\",\"1\",\"0\"))","v":{"$error":"#REF!"}}]
[null,{"$f":"IF(#REF!=\"Aprovado\",\"2\",IF(#REF!=\"Reprovado\",\"1\",\"0\"))","v":{"$error":"#REF!"}}]
[null,{"$f":"IF(#REF!=\"Aprovado\",\"2\",IF(#REF!=\"Reprovado\",\"1\",\"0\"))","v":{"$error":"#REF!"}}]
[null,{"$f":"IF(#REF!=\"Aprovado\",\"2\",IF(#REF!=\"Reprovado\",\"1\",\"0\"))","v":{"$error":"#REF!"}}]
[null,{"$f":"IF(#REF!=\"Aprovado\",\"2\",IF(#REF!=\"Reprovado\",\"1\",\"0\"))","v":{"$error":"#REF!"}}]
[null,{"$f":"IF(#REF!=\"Aprovado\",\"2\",IF(#REF!=\"Reprovado\",\"1\",\"0\"))","v":{"$error":"#REF!"}}]
[null,{"$f":"IF(#REF!=\"Aprovado\",\"2\",IF(#REF!=\"Reprovado\",\"1\",\"0\"))","v":{"$error":"#REF!"}}]
[null,{"$f":"IF(#REF!=\"Aprovado\",\"2\",IF(#REF!=\"Reprovado\",\"1\",\"0\"))","v":{"$error":"#REF!"}}]
[null,{"$f":"IF(#REF!=\"Aprovado\",\"2\",IF(#REF!=\"Reprovado\",\"1\",\"0\"))","v":{"$error":"#REF!"}}]
[null,{"$f":"IF(#REF!=\"Aprovado\",\"2\",IF(#REF!=\"Reprovado\",\"1\",\"0\"))","v":{"$error":"#REF!"}}]
[null,{"$f":"IF(#REF!=\"Aprovado\",\"2\",IF(#REF!=\"Reprovado\",\"1\",\"0\"))","v":{"$error":"#REF!"}}]
[null,{"$f":"IF(#REF!=\"Aprovado\",\"2\",IF(#REF!=\"Reprovado\",\"1\",\"0\"))","v":{"$error":"#REF!"}}]
[null,{"$f":"IF(#REF!=\"Aprovado\",\"2\",IF(#REF!=\"Reprovado\",\"1\",\"0\"))","v":{"$error":"#REF!"}}]
[null,{"$f":"IF(#REF!=\"Aprovado\",\"2\",IF(#REF!=\"Reprovado\",\"1\",\"0\"))","v":{"$error":"#REF!"}}]
[null,{"$f":"IF(#REF!=\"Aprovado\",\"2\",IF(#REF!=\"Reprovado\",\"1\",\"0\"))","v":{"$error":"#REF!"}}]
[null,{"$f":"IF(#REF!=\"Aprovado\",\"2\",IF(#REF!=\"Reprovado\",\"1\",\"0\"))","v":{"$error":"#REF!"}}]
[null,{"$f":"IF(#REF!=\"Aprovado\",\"2\",IF(#REF!=\"Reprovado\",\"1\",\"0\"))","v":{"$error":"#REF!"}}]
[null,{"$f":"IF(#REF!=\"Aprovado\",\"2\",IF(#REF!=\"Reprovado\",\"1\",\"0\"))","v":{"$error":"#REF!"}}]
[null,{"$f":"IF(#REF!=\"Aprovado\",\"2\",IF(#REF!=\"Reprovado\",\"1\",\"0\"))","v":{"$error":"#REF!"}}]
[null,{"$f":"IF(#REF!=\"Aprovado\",\"2\",IF(#REF!=\"Reprovado\",\"1\",\"0\"))","v":{"$error":"#REF!"}}]
[null,{"$f":"IF(#REF!=\"Aprovado\",\"2\",IF(#REF!=\"Reprovado\",\"1\",\"0\"))","v":{"$error":"#REF!"}}]
[null,{"$f":"IF(#REF!=\"Aprovado\",\"2\",IF(#REF!=\"Reprovado\",\"1\",\"0\"))","v":{"$error":"#REF!"}}]
[null,{"$f":"IF(#REF!=\"Aprovado\",\"2\",IF(#REF!=\"Reprovado\",\"1\",\"0\"))","v":{"$error":"#REF!"}}]
[null,{"$f":"IF(#REF!=\"Aprovado\",\"2\",IF(#REF!=\"Reprovado\",\"1\",\"0\"))","v":{"$error":"#REF!"}}]
[null,{"$f":"IF(#REF!=\"Aprovado\",\"2\",IF(#REF!=\"Reprovado\",\"1\",\"0\"))","v":{"$error":"#REF!"}}]
[null,{"$f":"IF(#REF!=\"Aprovado\",\"2\",IF(#REF!=\"Reprovado\",\"1\",\"0\"))","v":{"$error":"#REF!"}}]
[null,{"$f":"IF(#REF!=\"Aprovado\",\"2\",IF(#REF!=\"Reprovado\",\"1\",\"0\"))","v":{"$error":"#REF!"}}]
[null,{"$f":"IF(#REF!=\"Aprovado\",\"2\",IF(#REF!=\"Reprovado\",\"1\",\"0\"))","v":{"$error":"#REF!"}}]
[null,{"$f":"IF(#REF!=\"Aprovado\",\"2\",IF(#REF!=\"Reprovado\",\"1\",\"0\"))","v":{"$error":"#REF!"}}]
[null,{"$f":"IF(#REF!=\"Aprovado\",\"2\",IF(#REF!=\"Reprovado\",\"1\",\"0\"))","v":{"$error":"#REF!"}}]
[null,{"$f":"IF(#REF!=\"Aprovado\",\"2\",IF(#REF!=\"Reprovado\",\"1\",\"0\"))","v":{"$error":"#REF!"}}]
[null,{"$f":"IF(#REF!=\"Aprovado\",\"2\",IF(#REF!=\"Reprovado\",\"1\",\"0\"))","v":{"$error":"#REF!"}}]
[null,{"$f":"IF(#REF!=\"Aprovado\",\"2\",IF(#REF!=\"Reprovado\",\"1\",\"0\"))","v":{"$error":"#REF!"}}]
[null,{"$f":"IF(#REF!=\"Aprovado\",\"2\",IF(#REF!=\"Reprovado\",\"1\",\"0\"))","v":{"$error":"#REF!"}}]
[null,{"$f":"IF(#REF!=\"Aprovado\",\"2\",IF(#REF!=\"Reprovado\",\"1\",\"0\"))","v":{"$error":"#REF!"}}]
[null,{"$f":"IF(#REF!=\"Aprovado\",\"2\",IF(#REF!=\"Reprovado\",\"1\",\"0\"))","v":{"$error":"#REF!"}}]
[null,{"$f":"IF(#REF!=\"Aprovado\",\"2\",IF(#REF!=\"Reprovado\",\"1\",\"0\"))","v":{"$error":"#REF!"}}]
[null,{"$f":"IF(#REF!=\"Aprovado\",\"2\",IF(#REF!=\"Reprovado\",\"1\",\"0\"))","v":{"$error":"#REF!"}}]
[null,{"$f":"IF(#REF!=\"Aprovado\",\"2\",IF(#REF!=\"Reprovado\",\"1\",\"0\"))","v":{"$error":"#REF!"}}]
[null,{"$f":"IF(#REF!=\"Aprovado\",\"2\",IF(#REF!=\"Reprovado\",\"1\",\"0\"))","v":{"$error":"#REF!"}}]

{"sheet":"Financeiro","index":12,"n_rows":10,"n_cols":10,"rows_kept":10}
[]
[]
[]
[]
[{"$nulls":9},{"$f":"SUBTOTAL(9,Tabela1[Subtotal])","v":{"v":4580,"d":"R$ 4,580.00"}}]
[]
[null,"Data","Descrição","Receitas","Despesas","Subtotal"]
[null,"2018-12-15","COMPRA ESTRATÉGIA CONCURSOS",null,{"v":1200,"d":"R$ 1,200.00"},{"$f":"Tabela1[[#This Row],[Receitas]]-Tabela1[[#This Row],[Despesas]]","v":{"v":-1200,"d":"-R$ 1,200.00"}}]
[null,"2018-12-16","SALÁRIO",{"v":3500,"d":"R$ 3,500.00"},null,{"$f":"Tabela1[[#This Row],[Receitas]]-Tabela1[[#This Row],[Despesas]]","v":{"v":3500,"d":"R$ 3,500.00"}}]
[null,"2018-12-17","VENDA IPHONE",{"v":2280,"d":"R$ 2,280.00"},null,{"$f":"Tabela1[[#This Row],[Receitas]]-Tabela1[[#This Row],[Despesas]]","v":{"v":2280,"d":"R$ 2,280.00"}}]

{"sheet":"Rel_Exer","index":13,"n_rows":23,"n_cols":9,"rows_kept":23,"merged":[[21,2,21,6]]}
{"$rows_empty":21}
[null,"Selecione a matéria","LÍNGUA PORTUGUESA"]
[{"$nulls":8}," "]

{"sheet":"Rel_Sim","index":14,"n_rows":0,"n_cols":0,"rows_kept":0}

{"sheet":"Rel_Horas","index":15,"n_rows":46,"n_cols":19,"rows_kept":46,"merged":[[22,2,22,3]]}
{"$rows_empty":22}
[null,"Selecione o mês","Outubro"]
[]
[{"$nulls":7},"Matérias","Horas",{"$nulls":8},{"$f":"IF(C23=\"Janeiro\",1,IF(C23=\"Fevereiro\",2,IF(C23=\"Março\",3,IF(C23=\"Abril\",4,IF(C23=\"Maio\",5,IF(C23=\"Junho\",6,IF(C23=\"Julho\",7,IF(C23=\"Agosto\",8,IF(C23=\"Setembro\",9,IF(C23=\"Outubro\",10,IF(C23=\"Novembro\",11,IF(C23=\"Dezembro\",12))))))))))))","v":10},{"$f":"R25+1","v":11}]
[{"$nulls":7},{"$f":"Dados!B6","v":"LÍNGUA PORTUGUESA"},{"$f":"IFERROR(VLOOKUP(H26,Dados!$B$5:$N$25,$S$25,FALSE),\"\")","v":0}]
[{"$nulls":7},{"$f":"Dados!B7","v":"RACIOCÍNIO LÓGICO MATEMÁTICO"},{"$f":"IFERROR(VLOOKUP(H27,Dados!$B$5:$N$25,$S$25,FALSE),\"\")","v":0},{"$nulls":6},{"$f":"Edital!E15","v":"PORT"},null,null,{"$f":"SUMIF(Tabela5[],H26,Tabela5[Questões])","v":7}]
[{"$nulls":7},{"$f":"Dados!B8","v":"INFORMÁTICA"},{"$f":"IFERROR(VLOOKUP(H28,Dados!$B$5:$N$25,$S$25,FALSE),\"\")","v":0},{"$nulls":6},{"$f":"Edital!E16","v":"RLM"},null,null,{"$f":"SUMIF(Tabela5[],H27,Tabela5[Questões])","v":18}]
[{"$nulls":7},{"$f":"Dados!B9","v":0},{"$f":"IFERROR(VLOOKUP(H29,Dados!$B$5:$N$25,$S$25,FALSE),\"\")","v":0},{"$nulls":6},{"$f":"Edital!E17","v":"INFO"},null,null,{"$f":"SUMIF(Tabela5[],H28,Tabela5[Questões])","v":29}]
[{"$nulls":7},{"$f":"Dados!B10","v":0},{"$f":"IFERROR(VLOOKUP(H30,Dados!$B$5:$N$25,$S$25,FALSE),\"\")","v":0},{"$nulls":6},{"$f":"Edital!E18","v":0},null,null,{"$f":"SUMIF(Tabela5[],H29,Tabela5[Questões])","v":0}]
[{"$nulls":7},{"$f":"Dados!B11","v":0},{"$f":"IFERROR(VLOOKUP(H31,Dados!$B$5:$N$25,$S$25,FALSE),\"\")","v":0},{"$nulls":6},{"$f":"Edital!E19","v":0},null,null,{"$f":"SUMIF(Tabela5[],H30,Tabela5[Questões])","v":0}]
[{"$nulls":7},{"$f":"Dados!B12","v":0},{"$f":"IFERROR(VLOOKUP(H32,Dados!$B$5:$N$25,$S$25,FALSE),\"\")","v":0},{"$nulls":6},{"$f":"Edital!E20","v":0},null,null,{"$f":"SUMIF(Tabela5[],H31,Tabela5[Questões])","v":0}]
[{"$nulls":7},{"$f":"Dados!B13","v":0},{"$f":"IFERROR(VLOOKUP(H33,Dados!$B$5:$N$25,$S$25,FALSE),\"\")","v":0},{"$nulls":6},{"$f":"Edital!E21","v":0},null,null,{"$f":"SUMIF(Tabela5[],H32,Tabela5[Questões])","v":0}]
[{"$nulls":7},{"$f":"Dados!B14","v":0},{"$f":"IFERROR(VLOOKUP(H34,Dados!$B$5:$N$25,$S$25,FALSE),\"\")","v":0},{"$nulls":6},{"$f":"Edital!E22","v":0},null,null,{"$f":"SUMIF(Tabela5[],H33,Tabela5[Questões])","v":0}]
[{"$nulls":7},{"$f":"Dados!B15","v":0},{"$f":"IFERROR(VLOOKUP(H35,Dados!$B$5:$N$25,$S$25,FALSE),\"\")","v":0},{"$nulls":6},{"$f":"Edital!E23","v":0},null,null,{"$f":"SUMIF(Tabela5[],H34,Tabela5[Questões])","v":0}]
[{"$nulls":7},{"$f":"Dados!B16","v":0},{"$f":"IFERROR(VLOOKUP(H36,Dados!$B$5:$N$25,$S$25,FALSE),\"\")","v":0},{"$nulls":6},{"$f":"Edital!E24","v":0},null,null,{"$f":"SUMIF(Tabela5[],H35,Tabela5[Questões])","v":0}]
[{"$nulls":7},{"$f":"Dados!B17","v":0},{"$f":"IFERROR(VLOOKUP(H37,Dados!$B$5:$N$25,$S$25,FALSE),\"\")","v":0},{"$nulls":6},{"$f":"Edital!E25","v":0},null,null,{"$f":"SUMIF(Tabela5[],H36,Tabela5[Questões])","v":0}]
[{"$nulls":7},{"$f":"Dados!B18","v":0},{"$f":"IFERROR(VLOOKUP(H38,Dados!$B$5:$N$25,$S$25,FALSE),\"\")","v":0},{"$nulls":6},{"$f":"Edital!E26","v":0},null,null,{"$f":"SUMIF(Tabela5[],H37,Tabela5[Questões])","v":0}]
[{"$nulls":7},{"$f":"Dados!B19","v":0},{"$f":"IFERROR(VLOOKUP(H39,Dados!$B$5:$N$25,$S$25,FALSE),\"\")","v":0},{"$nulls":6},{"$f":"Edital!E27","v":0},null,null,{"$f":"SUMIF(Tabela5[],H38,Tabela5[Questões])","v":0}]
[{"$nulls":7},{"$f":"Dados!B20","v":0},{"$f":"IFERROR(VLOOKUP(H40,Dados!$B$5:$N$25,$S$25,FALSE),\"\")","v":0},{"$nulls":6},{"$f":"Edital!E28","v":0},null,null,{"$f":"SUMIF(Tabela5[],H39,Tabela5[Questões])","v":0}]
[{"$nulls":7},{"$f":"Dados!B21","v":0},{"$f":"IFERROR(VLOOKUP(H41,Dados!$B$5:$N$25,$S$25,FALSE),\"\")","v":0},{"$nulls":6},{"$f":"Edital!E29","v":0},null,null,{"$f":"SUMIF(Tabela5[],H40,Tabela5[Questões])","v":0}]
[{"$nulls":7},{"$f":"Dados!B22","v":0},{"$f":"IFERROR(VLOOKUP(H42,Dados!$B$5:$N$25,$S$25,FALSE),\"\")","v":0},{"$nulls":6},{"$f":"Edital!E30","v":0},null,null,{"$f":"SUMIF(Tabela5[],H41,Tabela5[Questões])","v":0}]
[{"$nulls":7},{"$f":"Dados!B23","v":0},{"$f":"IFERROR(VLOOKUP(H43,Dados!$B$5:$N$25,$S$25,FALSE),\"\")","v":0},{"$nulls":6},{"$f":"Edital!E31","v":0},null,null,{"$f":"SUMIF(Tabela5[],H42,Tabela5[Questões])","v":0}]
[{"$nulls":7},{"$f":"Dados!B24","v":0},{"$f":"IFERROR(VLOOKUP(H44,Dados!$B$5:$N$25,$S$25,FALSE),\"\")","v":0},{"$nulls":6},{"$f":"Edital!E32","v":0},null,null,{"$f":"SUMIF(Tabela5[],H43,Tabela5[Questões])","v":0}]
[{"$nulls":7},{"$f":"Dados!B25","v":0},{"$f":"IFERROR(VLOOKUP(H45,Dados!$B$5:$N$25,$S$25,FALSE),\"\")","v":0},{"$nulls":6},{"$f":"Edital!E33","v":0},null,null,{"$f":"SUMIF(Tabela5[],H44,Tabela5[Questões])","v":0}]
[{"$nulls":15},{"$f":"Edital!E34","v":0},null,null,{"$f":"SUMIF(Tabela5[],H45,Tabela5[Questões])","v":0}]

{"sheet":"Rel_Fin","index":16,"n_rows":11,"n_cols":16,"rows_kept":11}
[]
[]
[]
[]
[]
[]
[null,null,1,2,3,4,5,6,7,8,9,10,11,12]
[null,"Fluxo de caixa","Janeiro","Fevereiro","Março","Abril","Maio","Junho","Julho","Agosto","Setembro","Outubro","Novembro","Dezembro"]
[null,"Receitas",{"$f":"SUMPRODUCT((MONTH(Tabela1[Data])=C7)*(Tabela1[Receitas]))","v":{"v":0,"d":"R$ 0.00"}},{"$f":"SUMPRODUCT((MONTH(Tabela1[Data])=D7)*(Tabela1[Receitas]))","v":{"v":0,"d":"R$ 0.00"}},{"$f":"SUMPRODUCT((MONTH(Tabela1[Data])=E7)*(Tabela1[Receitas]))","v":{"v":0,"d":"R$ 0.00"}},{"$f":"SUMPRODUCT((MONTH(Tabela1[Data])=F7)*(Tabela1[Receitas]))","v":{"v":0,"d":"R$ 0.00"}},{"$f":"SUMPRODUCT((MONTH(Tabela1[Data])=G7)*(Tabela1[Receitas]))","v":{"v":0,"d":"R$ 0.00"}},{"$f":"SUMPRODUCT((MONTH(Tabela1[Data])=H7)*(Tabela1[Receitas]))","v":{"v":0,"d":"R$ 0.00"}},{"$f":"SUMPRODUCT((MONTH(Tabela1[Data])=I7)*(Tabela1[Receitas]))","v":{"v":0,"d":"R$ 0.00"}},{"$f":"SUMPRODUCT((MONTH(Tabela1[Data])=J7)*(Tabela1[Receitas]))","v":{"v":0,"d":"R$ 0.00"}},{"$f":"SUMPRODUCT((MONTH(Tabela1[Data])=K7)*(Tabela1[Receitas]))","v":{"v":0,"d":"R$ 0.00"}},{"$f":"SUMPRODUCT((MONTH(Tabela1[Data])=L7)*(Tabela1[Receitas]))","v":{"v":0,"d":"R$ 0.00"}},{"$f":"SUMPRODUCT((MONTH(Tabela1[Data])=M7)*(Tabela1[Receitas]))","v":{"v":0,"d":"R$ 0.00"}},{"$f":"SUMPRODUCT((MONTH(Tabela1[Data])=N7)*(Tabela1[Receitas]))","v":{"v":5780,"d":"R$ 5,780.00"}},"Receitas",{"$f":"SUM(C9:N9)","v":{"v":5780,"d":"R$ 5,780.00"}}]
[null,"Despesas",{"$f":"IFERROR(SUMPRODUCT((MONTH(Tabela1[Data])=C7)*(Tabela1[Despesas])),\"\")","v":{"v":0,"d":"R$ 0.00"}},{"$f":"IFERROR(SUMPRODUCT((MONTH(Tabela1[Data])=D7)*(Tabela1[Despesas])),\"\")","v":{"v":0,"d":"R$ 0.00"}},{"$f":"IFERROR(SUMPRODUCT((MONTH(Tabela1[Data])=E7)*(Tabela1[Despesas])),\"\")","v":{"v":0,"d":"R$ 0.00"}},{"$f":"IFERROR(SUMPRODUCT((MONTH(Tabela1[Data])=F7)*(Tabela1[Despesas])),\"\")","v":{"v":0,"d":"R$ 0.00"}},{"$f":"IFERROR(SUMPRODUCT((MONTH(Tabela1[Data])=G7)*(Tabela1[Despesas])),\"\")","v":{"v":0,"d":"R$ 0.00"}},{"$f":"IFERROR(SUMPRODUCT((MONTH(Tabela1[Data])=H7)*(Tabela1[Despesas])),\"\")","v":{"v":0,"d":"R$ 0.00"}},{"$f":"IFERROR(SUMPRODUCT((MONTH(Tabela1[Data])=I7)*(Tabela1[Despesas])),\"\")","v":{"v":0,"d":"R$ 0.00"}},{"$f":"IFERROR(SUMPRODUCT((MONTH(Tabela1[Data])=J7)*(Tabela1[Despesas])),\"\")","v":{"v":0,"d":"R$ 0.00"}},{"$f":"IFERROR(SUMPRODUCT((MONTH(Tabela1[Data])=K7)*(Tabela1[Despesas])),\"\")","v":{"v":0,"d":"R$ 0.00"}},{"$f":"IFERROR(SUMPRODUCT((MONTH(Tabela1[Data])=L7)*(Tabela1[Despesas])),\"\")","v":{"v":0,"d":"R$ 0.00"}},{"$f":"IFERROR(SUMPRODUCT((MONTH(Tabela1[Data])=M7)*(Tabela1[Despesas])),\"\")","v":{"v":0,"d":"R$ 0.00"}},{"$f":"IFERROR(SUMPRODUCT((MONTH(Tabela1[Data])=N7)*(Tabela1[Despesas])),\"\")","v":{"v":1200,"d":"R$ 1,200.00"}},"Despesas",{"$f":"SUM(C10:N10)","v":{"v":1200,"d":"R$ 1,200.00"}}]
[null,"Lucro/Prejuízo",{"$f":"C9-C10","v":{"v":0,"d":"R$ 0.00"}},{"$f":"D9-D10","v":{"v":0,"d":"R$ 0.00"}},{"v":0,"d":"R$ 0.00"},{"v":0,"d":"R$ 0.00"},{"v":0,"d":"R$ 0.00"},{"v":0,"d":"R$ 0.00"},{"v":0,"d":"R$ 0.00"},{"v":0,"d":"R$ 0.00"},{"v":0,"d":"R$ 0.00"},{"v":0,"d":"R$ 0.00"},{"v":0,"d":"R$ 0.00"},{"v":4580,"d":"R$ 4,580.00"}]

{"sheet":"Configurações","index":17,"n_rows":34,"n_cols":14,"rows_kept":34,"merged":[[15,2,15,3],[15,6,15,7],[15,10,15,11],[16,2,16,3],[16,6,16,7],[16,10,16,11],[17,2,17,3],[17,6,17,7],[17,10,17,11],[18,2,18,3],[18,6,18,7],[18,10,18,11],[24,2,24,3],[25,2,25,3],[26,2,26,3],[27,2,27,3],[28,2,28,3],[29,2,29,3],[30,2,30,3],[31,2,31,3],[32,2,32,3],[33,2,33,3]]}
[]
[]
[]
[]
[null,"Horários disponíveis para estudar"]
[null,"Digite o tempo que você tem disponível para estudar em cada dia da semana."]
[]
[]
[null,"Segunda",null,"Terça",null,"Quarta",null,"Quinta",null,"Sexta",null,"Sábado",null,"Domingo"]
[null,"10:00:00",null,"10:00:00",null,"10:00:00",null,"10:00:00",null,"10:00:00",null,"10:00:00",null,"10:00:00"]
[null,"Horas",null,"Horas",null,"Horas",null,"Horas",null,"Horas",null,"Horas",null,"Horas"]
[]
[null,"Metas mensais"]
[null,"Defina as metas de horas estudadas por mês que você pretende alcançar."]
[]
[null,"Janeiro",4.166666666666667,null,null,"Maio",5,null,null,"Setembro",5.833333333333333]
[null,"Fevereiro",4.166666666666667,null,null,"Junho",5,null,null,"Outubro",5.833333333333333]
[null,"Março",4.166666666666667,null,null,"Julho",5,null,null,"Novembro",5.833333333333333]
[null,"Abril",4.166666666666667,null,null,"Agosto",5,null,null,"Dezembro",5.833333333333333]
[]
[]
[null,"Lista de atividades"]
[]
[]
[null,"Atividade 1","Leitura"]
[null,"Atividade 2","Exercícios"]
[null,"Atividade 3","Videoaulas"]
[null,"Atividade 4","Revisão"]
[null,"Atividade 5","Atividade 5"]
[null,"Atividade 6","Atividade 6"]
[null,"Atividade 7","Atividade 7"]
[null,"Atividade 8","Atividade 8"]
[null,"Atividade 9","Atividade 9"]
[null,"Atividade 10","Atividade 10"]

{"sheet":"Dados","index":18,"n_rows":41,"n_cols":58,"rows_kept":41,"merged":[[3,51,3,52]]}
[null,"NÃO ALTERE !!!  DADOS IMPORTANTES"]
[]
[null,"Horas: Matérias x Meses",{"$nulls":14},"Cálculo horas disponíveis p/ estudo",{"$nulls":5},"Meta estudo x Realizado",{"$nulls":8},"Questões",{"$nulls":19},"Matéria"]
[{"$nulls":40},"Total resolvidas",{"$nulls":4},"MAIOR",null,null,"MENOR",null,null,"Mês",null,"Questões","Acertos","Erros","%Acerto","%Erro"]
[null,"Matéria x Mês",1,2,3,4,5,6,7,8,9,10,11,12,"Total Horas x Ano",null,"Data inicial dos estudos",{"$f":"Edital!I7","v":"2018-12-06"},{"$nulls":5},"Meta","Realizado",{"$nulls":6},"Mês","Mês","Questões resolvidas","Acertos","Erros","%Des","%Ace","%Erro",null,{"$f":"SUMIF(Tabela5[],AP5,Tabela5[Questões])","v":7},{"$f":"Edital!C15","v":"LÍNGUA PORTUGUESA"},null,1,{"$f":"LARGE($AO$5:$AO$24,1)","v":29},{"$f":"VLOOKUP(AS5,$AO$5:$AP$24,2,FALSE)","v":"INFORMÁTICA"},null,1,{"$f":"SMALL($AO$5:$AO$24,1)","v":0},{"$f":"VLOOKUP(AW5,$AO$5:$AP$24,2,)","v":0},null,"Jan",1,{"$f":"IFERROR(SUMPRODUCT((MONTH(Tabela5[Data])=BA5)*(Tabela5[Matéria]=Rel_Exer!$C$22)*(Tabela5[Questões])),\"\")","v":0},{"$f":"IFERROR(SUMPRODUCT((MONTH(Tabela5[Data])=BA5)*(Tabela5[Matéria]=Rel_Exer!$C$22)*(Tabela5[Acertos])),\"\")","v":0},{"$f":"BB5-BC5","v":0},{"$f":"IFERROR(BC5/BB5,\"\")","v":""},{"$f":"IFERROR(BD5/BB5,\"\")","v":""}]
[null,{"$f":"Edital!C15","v":"LÍNGUA PORTUGUESA"},{"$f":"IFERROR(SUMPRODUCT((MONTH(Tabela2[Data])=$C$5)*(Tabela2[Matéria]=B6)*Tabela2[Horas]),\"\")","v":0},{"$f":"IFERROR(SUMPRODUCT((MONTH(Tabela2[Data])=$D$5)*(Tabela2[Matéria]=B6)*Tabela2[Horas]),\"\")","v":0},{"$f":"IFERROR(SUMPRODUCT((MONTH(Tabela2[Data])=$E$5)*(Tabela2[Matéria]=B6)*Tabela2[Horas]),\"\")","v":0},{"$f":"IFERROR(SUMPRODUCT((MONTH(Tabela2[Data])=$F$5)*(Tabela2[Matéria]=B6)*Tabela2[Horas]),\"\")","v":0},{"$f":"IFERROR(SUMPRODUCT((MONTH(Tabela2[Data])=$G$5)*(Tabela2[Matéria]=B6)*Tabela2[Horas]),\"\")","v":0},{"$f":"IFERROR(SUMPRODUCT((MONTH(Tabela2[Data])=$H$5)*(Tabela2[Matéria]=B6)*Tabela2[Horas]),\"\")","v":0},{"$f":"IFERROR(SUMPRODUCT((MONTH(Tabela2[Data])=$I$5)*(Tabela2[Matéria]=B6)*Tabela2[Horas]),\"\")","v":0},{"$f":"IFERROR(SUMPRODUCT((MONTH(Tabela2[Data])=$J$5)*(Tabela2[Matéria]=B6)*Tabela2[Horas]),\"\")","v":0},{"$f":"IFERROR(SUMPRODUCT((MONTH(Tabela2[Data])=$K$5)*(Tabela2[Matéria]=B6)*Tabela2[Horas]),\"\")","v":0},{"$f":"IFERROR(SUMPRODUCT((MONTH(Tabela2[Data])=$L$5)*(Tabela2[Matéria]=B6)*Tabela2[Horas]),\"\")","v":0},{"$f":"IFERROR(SUMPRODUCT((MONTH(Tabela2[Data])=$M$5)*(Tabela2[Matéria]=B6)*Tabela2[Horas]),\"\")","v":0},{"$f":"IFERROR(SUMPRODUCT((MONTH(Tabela2[Data])=$N$5)*(Tabela2[Matéria]=B6)*Tabela2[Horas]),\"\")","v":0},null,null,"Data do concurso",{"$f":"Edital!I9","v":"2019-02-03"},{"$nulls":3},"Jan",1,{"$f":"Configurações!C16","v":4.166666666666667},{"$f":"C26","v":0},{"$nulls":6},"Jan",1,{"$f":"SUMPRODUCT((MONTH(Tabela5[Data])=AG6)*(Tabela5[Questões]))","v":0},{"$f":"SUMPRODUCT((MONTH(Tabela5[Data])=AG6)*(Tabela5[Acertos]))","v":0},{"$f":"AH6-AI6","v":0},{"$f":"IFERROR(AI6/AH6,\"\")","v":""},{"$f":"IFERROR(AI6/AH6,\"\")","v":""},{"$f":"IFERROR(AJ6/AH6,\"\")","v":""},null,{"$f":"SUMIF(Tabela5[],AP6,Tabela5[Questões])","v":18},{"$f":"Edital!C16","v":"RACIOCÍNIO LÓGICO MATEMÁTICO"},null,2,{"$f":"LARGE($AO$5:$AO$24,2)","v":18},{"$f":"VLOOKUP(AS6,$AO$5:$AP$24,2,FALSE)","v":"RACIOCÍNIO LÓGICO MATEMÁTICO"},null,2,{"$f":"SMALL($AO$5:$AO$24,2)","v":0},{"$f":"VLOOKUP(AW6,$AO$5:$AP$24,2,)","v":0},null,"Fev",2,{"$f":"IFERROR(SUMPRODUCT((MONTH(Tabela5[Data])=BA6)*(Tabela5[Matéria]=Rel_Exer!$C$22)*(Tabela5[Questões])),\"\")","v":0},{"$f":"IFERROR(SUMPRODUCT((MONTH(Tabela5[Data])=BA6)*(Tabela5[Matéria]=Rel_Exer!$C$22)*(Tabela5[Acertos])),\"\")","v":0},{"$f":"BB6-BC6","v":0},{"$f":"IFERROR(BC6/BB6,\"\")","v":""},{"$f":"IFERROR(BD6/BB6,\"\")","v":""}]
[null,{"$f":"Edital!C16","v":"RACIOCÍNIO LÓGICO MATEMÁTICO"},{"$f":"IFERROR(SUMPRODUCT((MONTH(Tabela2[Data])=$C$5)*(Tabela2[Matéria]=B7)*Tabela2[Horas]),\"\")","v":0},{"$f":"IFERROR(SUMPRODUCT((MONTH(Tabela2[Data])=$D$5)*(Tabela2[Matéria]=B7)*Tabela2[Horas]),\"\")","v":0},{"$f":"IFERROR(SUMPRODUCT((MONTH(Tabela2[Data])=$E$5)*(Tabela2[Matéria]=B7)*Tabela2[Horas]),\"\")","v":0},{"$f":"IFERROR(SUMPRODUCT((MONTH(Tabela2[Data])=$F$5)*(Tabela2[Matéria]=B7)*Tabela2[Horas]),\"\")","v":0},{"$f":"IFERROR(SUMPRODUCT((MONTH(Tabela2[Data])=$G$5)*(Tabela2[Matéria]=B7)*Tabela2[Horas]),\"\")","v":0},{"$f":"IFERROR(SUMPRODUCT((MONTH(Tabela2[Data])=$H$5)*(Tabela2[Matéria]=B7)*Tabela2[Horas]),\"\")","v":0},{"$f":"IFERROR(SUMPRODUCT((MONTH(Tabela2[Data])=$I$5)*(Tabela2[Matéria]=B7)*Tabela2[Horas]),\"\")","v":0},{"$f":"IFERROR(SUMPRODUCT((MONTH(Tabela2[Data])=$J$5)*(Tabela2[Matéria]=B7)*Tabela2[Horas]),\"\")","v":0},{"$f":"IFERROR(SUMPRODUCT((MONTH(Tabela2[Data])=$K$5)*(Tabela2[Matéria]=B7)*Tabela2[Horas]),\"\")","v":0},{"$f":"IFERROR(SUMPRODUCT((MONTH(Tabela2[Data])=$L$5)*(Tabela2[Matéria]=B7)*Tabela2[Horas]),\"\")","v":0},{"$f":"IFERROR(SUMPRODUCT((MONTH(Tabela2[Data])=$M$5)*(Tabela2[Matéria]=B7)*Tabela2[Horas]),\"\")","v":0},{"$f":"IFERROR(SUMPRODUCT((MONTH(Tabela2[Data])=$N$5)*(Tabela2[Matéria]=B7)*Tabela2[Horas]),\"\")","v":0},{"$nulls":7},"Fev",2,{"$f":"Configurações!C17","v":4.166666666666667},{"$f":"D26","v":0},{"$nulls":6},"Fev",2,{"$f":"SUMPRODUCT((MONTH(Tabela5[Data])=AG7)*(Tabela5[Questões]))","v":0},{"$f":"SUMPRODUCT((MONTH(Tabela5[Data])=AG7)*(Tabela5[Acertos]))","v":0},{"$f":"AH7-AI7","v":0},{"$f":"IFERROR(AI7/AH7,\"\")","v":""},{"$f":"IFERROR(AI7/AH7,\"\")","v":""},{"$f":"IFERROR(AJ7/AH7,\"\")","v":""},null,{"$f":"SUMIF(Tabela5[],AP7,Tabela5[Questões])","v":29},{"$f":"Edital!C17","v":"INFORMÁTICA"},null,3,{"$f":"LARGE($AO$5:$AO$24,3)","v":7},{"$f":"VLOOKUP(AS7,$AO$5:$AP$24,2,FALSE)","v":"LÍNGUA PORTUGUESA"},null,3,{"$f":"SMALL($AO$5:$AO$24,3)","v":0},{"$f":"VLOOKUP(AW7,$AO$5:$AP$24,2,)","v":0},null,"Mar",3,{"$f":"IFERROR(SUMPRODUCT((MONTH(Tabela5[Data])=BA7)*(Tabela5[Matéria]=Rel_Exer!$C$22)*(Tabela5[Questões])),\"\")","v":0},{"$f":"IFERROR(SUMPRODUCT((MONTH(Tabela5[Data])=BA7)*(Tabela5[Matéria]=Rel_Exer!$C$22)*(Tabela5[Acertos])),\"\")","v":0},0,"",""]
[null,{"$f":"Edital!C17","v":"INFORMÁTICA"},{"$f":"IFERROR(SUMPRODUCT((MONTH(Tabela2[Data])=$C$5)*(Tabela2[Matéria]=B8)*Tabela2[Horas]),\"\")","v":0},{"$f":"IFERROR(SUMPRODUCT((MONTH(Tabela2[Data])=$D$5)*(Tabela2[Matéria]=B8)*Tabela2[Horas]),\"\")","v":0},{"$f":"IFERROR(SUMPRODUCT((MONTH(Tabela2[Data])=$E$5)*(Tabela2[Matéria]=B8)*Tabela2[Horas]),\"\")","v":0},{"$f":"IFERROR(SUMPRODUCT((MONTH(Tabela2[Data])=$F$5)*(Tabela2[Matéria]=B8)*Tabela2[Horas]),\"\")","v":0},{"$f":"IFERROR(SUMPRODUCT((MONTH(Tabela2[Data])=$G$5)*(Tabela2[Matéria]=B8)*Tabela2[Horas]),\"\")","v":0},{"$f":"IFERROR(SUMPRODUCT((MONTH(Tabela2[Data])=$H$5)*(Tabela2[Matéria]=B8)*Tabela2[Horas]),\"\")","v":0},{"$f":"IFERROR(SUMPRODUCT((MONTH(Tabela2[Data])=$I$5)*(Tabela2[Matéria]=B8)*Tabela2[Horas]),\"\")","v":0},{"$f":"IFERROR(SUMPRODUCT((MONTH(Tabela2[Data])=$J$5)*(Tabela2[Matéria]=B8)*Tabela2[Horas]),\"\")","v":0},{"$f":"IFERROR(SUMPRODUCT((MONTH(Tabela2[Data])=$K$5)*(Tabela2[Matéria]=B8)*Tabela2[Horas]),\"\")","v":0},{"$f":"IFERROR(SUMPRODUCT((MONTH(Tabela2[Data])=$L$5)*(Tabela2[Matéria]=B8)*Tabela2[Horas]),\"\")","v":0},{"$f":"IFERROR(SUMPRODUCT((MONTH(Tabela2[Data])=$M$5)*(Tabela2[Matéria]=B8)*Tabela2[Horas]),\"\")","v":0},{"$f":"IFERROR(SUMPRODUCT((MONTH(Tabela2[Data])=$N$5)*(Tabela2[Matéria]=B8)*Tabela2[Horas]),\"\")","v":0},null,null,"Segundas",{"$f":"INT((WEEKDAY($R$5-2)-$R$5+$R6)/7)","v":8},{"$f":"Configurações!B10","v":"10:00:00"},{"$f":"IFERROR(R8*S8,\"\")","v":3.3333333333333335},null,"Mar",3,{"$f":"Configurações!C18","v":4.166666666666667},{"$f":"E26","v":0},{"$nulls":6},"Mar",3,{"$f":"SUMPRODUCT((MONTH(Tabela5[Data])=AG8)*(Tabela5[Questões]))","v":0},{"$f":"SUMPRODUCT((MONTH(Tabela5[Data])=AG8)*(Tabela5[Acertos]))","v":0},0,"","","",null,{"$f":"SUMIF(Tabela5[],AP8,Tabela5[Questões])","v":0},{"$f":"Edital!C18","v":0},null,4,{"$f":"LARGE($AO$5:$AO$24,4)","v":0},{"$f":"VLOOKUP(AS8,$AO$5:$AP$24,2,FALSE)","v":0},null,4,{"$f":"SMALL($AO$5:$AO$24,4)","v":0},{"$f":"VLOOKUP(AW8,$AO$5:$AP$24,2,)","v":0},null,"Abr",4,{"$f":"IFERROR(SUMPRODUCT((MONTH(Tabela5[Data])=BA8)*(Tabela5[Matéria]=Rel_Exer!$C$22)*(Tabela5[Questões])),\"\")","v":0},{"$f":"IFERROR(SUMPRODUCT((MONTH(Tabela5[Data])=BA8)*(Tabela5[Matéria]=Rel_Exer!$C$22)*(Tabela5[Acertos])),\"\")","v":0},0,"",""]
[null,{"$f":"Edital!C18","v":0},{"$f":"IFERROR(SUMPRODUCT((MONTH(Tabela2[Data])=$C$5)*(Tabela2[Matéria]=B9)*Tabela2[Horas]),\"\")","v":0},{"$f":"IFERROR(SUMPRODUCT((MONTH(Tabela2[Data])=$D$5)*(Tabela2[Matéria]=B9)*Tabela2[Horas]),\"\")","v":0},{"$f":"IFERROR(SUMPRODUCT((MONTH(Tabela2[Data])=$E$5)*(Tabela2[Matéria]=B9)*Tabela2[Horas]),\"\")","v":0},{"$f":"IFERROR(SUMPRODUCT((MONTH(Tabela2[Data])=$F$5)*(Tabela2[Matéria]=B9)*Tabela2[Horas]),\"\")","v":0},{"$f":"IFERROR(SUMPRODUCT((MONTH(Tabela2[Data])=$G$5)*(Tabela2[Matéria]=B9)*Tabela2[Horas]),\"\")","v":0},{"$f":"IFERROR(SUMPRODUCT((MONTH(Tabela2[Data])=$H$5)*(Tabela2[Matéria]=B9)*Tabela2[Horas]),\"\")","v":0},{"$f":"IFERROR(SUMPRODUCT((MONTH(Tabela2[Data])=$I$5)*(Tabela2[Matéria]=B9)*Tabela2[Horas]),\"\")","v":0},{"$f":"IFERROR(SUMPRODUCT((MONTH(Tabela2[Data])=$J$5)*(Tabela2[Matéria]=B9)*Tabela2[Horas]),\"\")","v":0},{"$f":"IFERROR(SUMPRODUCT((MONTH(Tabela2[Data])=$K$5)*(Tabela2[Matéria]=B9)*Tabela2[Horas]),\"\")","v":0},{"$f":"IFERROR(SUMPRODUCT((MONTH(Tabela2[Data])=$L$5)*(Tabela2[Matéria]=B9)*Tabela2[Horas]),\"\")","v":0},{"$f":"IFERROR(SUMPRODUCT((MONTH(Tabela2[Data])=$M$5)*(Tabela2[Matéria]=B9)*Tabela2[Horas]),\"\")","v":0},{"$f":"IFERROR(SUMPRODUCT((MONTH(Tabela2[Data])=$N$5)*(Tabela2[Matéria]=B9)*Tabela2[Horas]),\"\")","v":0},null,null,"Terças",{"$f":"INT((WEEKDAY($R$5-3)-$R$5+$R6)/7)","v":8},{"$f":"Configurações!D10","v":"10:00:00"},{"$f":"IFERROR(R9*S9,\"\")","v":3.3333333333333335},null,"Abr",4,{"$f":"Configurações!C19","v":4.166666666666667},{"$f":"F26","v":0},{"$nulls":6},"Abr",4,{"$f":"SUMPRODUCT((MONTH(Tabela5[Data])=AG9)*(Tabela5[Questões]))","v":0},{"$f":"SUMPRODUCT((MONTH(Tabela5[Data])=AG9)*(Tabela5[Acertos]))","v":0},0,"","","",null,{"$f":"SUMIF(Tabela5[],AP9,Tabela5[Questões])","v":0},{"$f":"Edital!C19","v":0},null,5,{"$f":"LARGE($AO$5:$AO$24,5)","v":0},{"$f":"VLOOKUP(AS9,$AO$5:$AP$24,2,FALSE)","v":0},null,5,{"$f":"SMALL($AO$5:$AO$24,5)","v":0},{"$f":"VLOOKUP(AW9,$AO$5:$AP$24,2,)","v":0},null,"Mai",5,{"$f":"IFERROR(SUMPRODUCT((MONTH(Tabela5[Data])=BA9)*(Tabela5[Matéria]=Rel_Exer!$C$22)*(Tabela5[Questões])),\"\")","v":0},{"$f":"IFERROR(SUMPRODUCT((MONTH(Tabela5[Data])=BA9)*(Tabela5[Matéria]=Rel_Exer!$C$22)*(Tabela5[Acertos])),\"\")","v":0},0,"",""]
[null,{"$f":"Edital!C19","v":0},{"$f":"IFERROR(SUMPRODUCT((MONTH(Tabela2[Data])=$C$5)*(Tabela2[Matéria]=B10)*Tabela2[Horas]),\"\")","v":0},{"$f":"IFERROR(SUMPRODUCT((MONTH(Tabela2[Data])=$D$5)*(Tabela2[Matéria]=B10)*Tabela2[Horas]),\"\")","v":0},{"$f":"IFERROR(SUMPRODUCT((MONTH(Tabela2[Data])=$E$5)*(Tabela2[Matéria]=B10)*Tabela2[Horas]),\"\")","v":0},{"$f":"IFERROR(SUMPRODUCT((MONTH(Tabela2[Data])=$F$5)*(Tabela2[Matéria]=B10)*Tabela2[Horas]),\"\")","v":0},{"$f":"IFERROR(SUMPRODUCT((MONTH(Tabela2[Data])=$G$5)*(Tabela2[Matéria]=B10)*Tabela2[Horas]),\"\")","v":0},{"$f":"IFERROR(SUMPRODUCT((MONTH(Tabela2[Data])=$H$5)*(Tabela2[Matéria]=B10)*Tabela2[Horas]),\"\")","v":0},{"$f":"IFERROR(SUMPRODUCT((MONTH(Tabela2[Data])=$I$5)*(Tabela2[Matéria]=B10)*Tabela2[Horas]),\"\")","v":0},{"$f":"IFERROR(SUMPRODUCT((MONTH(Tabela2[Data])=$J$5)*(Tabela2[Matéria]=B10)*Tabela2[Horas]),\"\")","v":0},{"$f":"IFERROR(SUMPRODUCT((MONTH(Tabela2[Data])=$K$5)*(Tabela2[Matéria]=B10)*Tabela2[Horas]),\"\")","v":0},{"$f":"IFERROR(SUMPRODUCT((MONTH(Tabela2[Data])=$L$5)*(Tabela2[Matéria]=B10)*Tabela2[Horas]),\"\")","v":0},{"$f":"IFERROR(SUMPRODUCT((MONTH(Tabela2[Data])=$M$5)*(Tabela2[Matéria]=B10)*Tabela2[Horas]),\"\")","v":0},{"$f":"IFERROR(SUMPRODUCT((MONTH(Tabela2[Data])=$N$5)*(Tabela2[Matéria]=B10)*Tabela2[Horas]),\"\")","v":0},null,null,"Quartas",{"$f":"INT((WEEKDAY($R$5-4)-$R$5+$R6)/7)","v":8},{"$f":"Configurações!F10","v":"10:00:00"},3.3333333333333335,null,"Mai",5,{"$f":"Configurações!G16","v":5},{"$f":"G26","v":0},{"$nulls":6},"Mai",5,{"$f":"SUMPRODUCT((MONTH(Tabela5[Data])=AG10)*(Tabela5[Questões]))","v":0},{"$f":"SUMPRODUCT((MONTH(Tabela5[Data])=AG10)*(Tabela5[Acertos]))","v":0},0,"","","",null,{"$f":"SUMIF(Tabela5[],AP10,Tabela5[Questões])","v":0},{"$f":"Edital!C20","v":0},{"$nulls":9},"Jun",6,{"$f":"IFERROR(SUMPRODUCT((MONTH(Tabela5[Data])=BA10)*(Tabela5[Matéria]=Rel_Exer!$C$22)*(Tabela5[Questões])),\"\")","v":0},{"$f":"IFERROR(SUMPRODUCT((MONTH(Tabela5[Data])=BA10)*(Tabela5[Matéria]=Rel_Exer!$C$22)*(Tabela5[Acertos])),\"\")","v":0},0,"",""]
[null,{"$f":"Edital!C20","v":0},{"$f":"IFERROR(SUMPRODUCT((MONTH(Tabela2[Data])=$C$5)*(Tabela2[Matéria]=B11)*Tabela2[Horas]),\"\")","v":0},{"$f":"IFERROR(SUMPRODUCT((MONTH(Tabela2[Data])=$D$5)*(Tabela2[Matéria]=B11)*Tabela2[Horas]),\"\")","v":0},{"$f":"IFERROR(SUMPRODUCT((MONTH(Tabela2[Data])=$E$5)*(Tabela2[Matéria]=B11)*Tabela2[Horas]),\"\")","v":0},{"$f":"IFERROR(SUMPRODUCT((MONTH(Tabela2[Data])=$F$5)*(Tabela2[Matéria]=B11)*Tabela2[Horas]),\"\")","v":0},{"$f":"IFERROR(SUMPRODUCT((MONTH(Tabela2[Data])=$G$5)*(Tabela2[Matéria]=B11)*Tabela2[Horas]),\"\")","v":0},{"$f":"IFERROR(SUMPRODUCT((MONTH(Tabela2[Data])=$H$5)*(Tabela2[Matéria]=B11)*Tabela2[Horas]),\"\")","v":0},{"$f":"IFERROR(SUMPRODUCT((MONTH(Tabela2[Data])=$I$5)*(Tabela2[Matéria]=B11)*Tabela2[Horas]),\"\")","v":0},{"$f":"IFERROR(SUMPRODUCT((MONTH(Tabela2[Data])=$J$5)*(Tabela2[Matéria]=B11)*Tabela2[Horas]),\"\")","v":0},{"$f":"IFERROR(SUMPRODUCT((MONTH(Tabela2[Data])=$K$5)*(Tabela2[Matéria]=B11)*Tabela2[Horas]),\"\")","v":0},{"$f":"IFERROR(SUMPRODUCT((MONTH(Tabela2[Data])=$L$5)*(Tabela2[Matéria]=B11)*Tabela2[Horas]),\"\")","v":0},{"$f":"IFERROR(SUMPRODUCT((MONTH(Tabela2[Data])=$M$5)*(Tabela2[Matéria]=B11)*Tabela2[Horas]),\"\")","v":0},{"$f":"IFERROR(SUMPRODUCT((MONTH(Tabela2[Data])=$N$5)*(Tabela2[Matéria]=B11)*Tabela2[Horas]),\"\")","v":0},null,null,"Quintas",{"$f":"INT((WEEKDAY($R$5-5)-$R$5+$R6)/7)","v":9},{"$f":"Configurações!H10","v":"10:00:00"},3.75,null,"Jun",6,{"$f":"Configurações!G17","v":5},{"$f":"H26","v":0},{"$nulls":6},"Jun",6,{"$f":"SUMPRODUCT((MONTH(Tabela5[Data])=AG11)*(Tabela5[Questões]))","v":0},{"$f":"SUMPRODUCT((MONTH(Tabela5[Data])=AG11)*(Tabela5[Acertos]))","v":0},0,"","","",null,{"$f":"SUMIF(Tabela5[],AP11,Tabela5[Questões])","v":0},{"$f":"Edital!C21","v":0},{"$nulls":9},"Jul",7,{"$f":"IFERROR(SUMPRODUCT((MONTH(Tabela5[Data])=BA11)*(Tabela5[Matéria]=Rel_Exer!$C$22)*(Tabela5[Questões])),\"\")","v":0},{"$f":"IFERROR(SUMPRODUCT((MONTH(Tabela5[Data])=BA11)*(Tabela5[Matéria]=Rel_Exer!$C$22)*(Tabela5[Acertos])),\"\")","v":0},0,"",""]
[null,{"$f":"Edital!C21","v":0},{"$f":"IFERROR(SUMPRODUCT((MONTH(Tabela2[Data])=$C$5)*(Tabela2[Matéria]=B12)*Tabela2[Horas]),\"\")","v":0},{"$f":"IFERROR(SUMPRODUCT((MONTH(Tabela2[Data])=$D$5)*(Tabela2[Matéria]=B12)*Tabela2[Horas]),\"\")","v":0},{"$f":"IFERROR(SUMPRODUCT((MONTH(Tabela2[Data])=$E$5)*(Tabela2[Matéria]=B12)*Tabela2[Horas]),\"\")","v":0},{"$f":"IFERROR(SUMPRODUCT((MONTH(Tabela2[Data])=$F$5)*(Tabela2[Matéria]=B12)*Tabela2[Horas]),\"\")","v":0},{"$f":"IFERROR(SUMPRODUCT((MONTH(Tabela2[Data])=$G$5)*(Tabela2[Matéria]=B12)*Tabela2[Horas]),\"\")","v":0},{"$f":"IFERROR(SUMPRODUCT((MONTH(Tabela2[Data])=$H$5)*(Tabela2[Matéria]=B12)*Tabela2[Horas]),\"\")","v":0},{"$f":"IFERROR(SUMPRODUCT((MONTH(Tabela2[Data])=$I$5)*(Tabela2[Matéria]=B12)*Tabela2[Horas]),\"\")","v":0},{"$f":"IFERROR(SUMPRODUCT((MONTH(Tabela2[Data])=$J$5)*(Tabela2[Matéria]=B12)*Tabela2[Horas]),\"\")","v":0},{"$f":"IFERROR(SUMPRODUCT((MONTH(Tabela2[Data])=$K$5)*(Tabela2[Matéria]=B12)*Tabela2[Horas]),\"\")","v":0},{"$f":"IFERROR(SUMPRODUCT((MONTH(Tabela2[Data])=$L$5)*(Tabela2[Matéria]=B12)*Tabela2[Horas]),\"\")","v":0},{"$f":"IFERROR(SUMPRODUCT((MONTH(Tabela2[Data])=$M$5)*(Tabela2[Matéria]=B12)*Tabela2[Horas]),\"\")","v":0},{"$f":"IFERROR(SUMPRODUCT((MONTH(Tabela2[Data])=$N$5)*(Tabela2[Matéria]=B12)*Tabela2[Horas]),\"\")","v":0},null,null,"Sextas",{"$f":"INT((WEEKDAY($R$5-6)-$R$5+$R6)/7)","v":9},{"$f":"Configurações!J10","v":"10:00:00"},3.75,null,"Jul",7,{"$f":"Configurações!G18","v":5},{"$f":"I26","v":0},{"$nulls":6},"Jul",7,{"$f":"SUMPRODUCT((MONTH(Tabela5[Data])=AG12)*(Tabela5[Questões]))","v":0},{"$f":"SUMPRODUCT((MONTH(Tabela5[Data])=AG12)*(Tabela5[Acertos]))","v":0},0,"","","",null,{"$f":"SUMIF(Tabela5[],AP12,Tabela5[Questões])","v":0},{"$f":"Edital!C22","v":0},{"$nulls":9},"Ago",8,{"$f":"IFERROR(SUMPRODUCT((MONTH(Tabela5[Data])=BA12)*(Tabela5[Matéria]=Rel_Exer!$C$22)*(Tabela5[Questões])),\"\")","v":0},{"$f":"IFERROR(SUMPRODUCT((MONTH(Tabela5[Data])=BA12)*(Tabela5[Matéria]=Rel_Exer!$C$22)*(Tabela5[Acertos])),\"\")","v":0},0,"",""]
[null,{"$f":"Edital!C22","v":0},{"$f":"IFERROR(SUMPRODUCT((MONTH(Tabela2[Data])=$C$5)*(Tabela2[Matéria]=B13)*Tabela2[Horas]),\"\")","v":0},{"$f":"IFERROR(SUMPRODUCT((MONTH(Tabela2[Data])=$D$5)*(Tabela2[Matéria]=B13)*Tabela2[Horas]),\"\")","v":0},{"$f":"IFERROR(SUMPRODUCT((MONTH(Tabela2[Data])=$E$5)*(Tabela2[Matéria]=B13)*Tabela2[Horas]),\"\")","v":0},{"$f":"IFERROR(SUMPRODUCT((MONTH(Tabela2[Data])=$F$5)*(Tabela2[Matéria]=B13)*Tabela2[Horas]),\"\")","v":0},{"$f":"IFERROR(SUMPRODUCT((MONTH(Tabela2[Data])=$G$5)*(Tabela2[Matéria]=B13)*Tabela2[Horas]),\"\")","v":0},{"$f":"IFERROR(SUMPRODUCT((MONTH(Tabela2[Data])=$H$5)*(Tabela2[Matéria]=B13)*Tabela2[Horas]),\"\")","v":0},{"$f":"IFERROR(SUMPRODUCT((MONTH(Tabela2[Data])=$I$5)*(Tabela2[Matéria]=B13)*Tabela2[Horas]),\"\")","v":0},{"$f":"IFERROR(SUMPRODUCT((MONTH(Tabela2[Data])=$J$5)*(Tabela2[Matéria]=B13)*Tabela2[Horas]),\"\")","v":0},{"$f":"IFERROR(SUMPRODUCT((MONTH(Tabela2[Data])=$K$5)*(Tabela2[Matéria]=B13)*Tabela2[Horas]),\"\")","v":0},{"$f":"IFERROR(SUMPRODUCT((MONTH(Tabela2[Data])=$L$5)*(Tabela2[Matéria]=B13)*Tabela2[Horas]),\"\")","v":0},{"$f":"IFERROR(SUMPRODUCT((MONTH(Tabela2[Data])=$M$5)*(Tabela2[Matéria]=B13)*Tabela2[Horas]),\"\")","v":0},{"$f":"IFERROR(SUMPRODUCT((MONTH(Tabela2[Data])=$N$5)*(Tabela2[Matéria]=B13)*Tabela2[Horas]),\"\")","v":0},null,null,"Sábados",{"$f":"INT((WEEKDAY($R$5-7)-$R$5+$R6)/7)","v":9},{"$f":"Configurações!L10","v":"10:00:00"},3.75,null,"Ago",8,{"$f":"Configurações!G19","v":5},{"$f":"J26","v":0},{"$nulls":6},"Ago",8,{"$f":"SUMPRODUCT((MONTH(Tabela5[Data])=AG13)*(Tabela5[Questões]))","v":0},{"$f":"SUMPRODUCT((MONTH(Tabela5[Data])=AG13)*(Tabela5[Acertos]))","v":0},0,"","","",null,{"$f":"SUMIF(Tabela5[],AP13,Tabela5[Questões])","v":0},{"$f":"Edital!C23","v":0},{"$nulls":9},"Set",9,{"$f":"IFERROR(SUMPRODUCT((MONTH(Tabela5[Data])=BA13)*(Tabela5[Matéria]=Rel_Exer!$C$22)*(Tabela5[Questões])),\"\")","v":0},{"$f":"IFERROR(SUMPRODUCT((MONTH(Tabela5[Data])=BA13)*(Tabela5[Matéria]=Rel_Exer!$C$22)*(Tabela5[Acertos])),\"\")","v":0},0,"",""]
[null,{"$f":"Edital!C23","v":0},{"$f":"IFERROR(SUMPRODUCT((MONTH(Tabela2[Data])=$C$5)*(Tabela2[Matéria]=B14)*Tabela2[Horas]),\"\")","v":0},{"$f":"IFERROR(SUMPRODUCT((MONTH(Tabela2[Data])=$D$5)*(Tabela2[Matéria]=B14)*Tabela2[Horas]),\"\")","v":0},{"$f":"IFERROR(SUMPRODUCT((MONTH(Tabela2[Data])=$E$5)*(Tabela2[Matéria]=B14)*Tabela2[Horas]),\"\")","v":0},{"$f":"IFERROR(SUMPRODUCT((MONTH(Tabela2[Data])=$F$5)*(Tabela2[Matéria]=B14)*Tabela2[Horas]),\"\")","v":0},{"$f":"IFERROR(SUMPRODUCT((MONTH(Tabela2[Data])=$G$5)*(Tabela2[Matéria]=B14)*Tabela2[Horas]),\"\")","v":0},{"$f":"IFERROR(SUMPRODUCT((MONTH(Tabela2[Data])=$H$5)*(Tabela2[Matéria]=B14)*Tabela2[Horas]),\"\")","v":0},{"$f":"IFERROR(SUMPRODUCT((MONTH(Tabela2[Data])=$I$5)*(Tabela2[Matéria]=B14)*Tabela2[Horas]),\"\")","v":0},{"$f":"IFERROR(SUMPRODUCT((MONTH(Tabela2[Data])=$J$5)*(Tabela2[Matéria]=B14)*Tabela2[Horas]),\"\")","v":0},{"$f":"IFERROR(SUMPRODUCT((MONTH(Tabela2[Data])=$K$5)*(Tabela2[Matéria]=B14)*Tabela2[Horas]),\"\")","v":0},{"$f":"IFERROR(SUMPRODUCT((MONTH(Tabela2[Data])=$L$5)*(Tabela2[Matéria]=B14)*Tabela2[Horas]),\"\")","v":0},{"$f":"IFERROR(SUMPRODUCT((MONTH(Tabela2[Data])=$M$5)*(Tabela2[Matéria]=B14)*Tabela2[Horas]),\"\")","v":0},{"$f":"IFERROR(SUMPRODUCT((MONTH(Tabela2[Data])=$N$5)*(Tabela2[Matéria]=B14)*Tabela2[Horas]),\"\")","v":0},null,null,"Domingos",{"$f":"INT((WEEKDAY($R$5-1)-$R$5+$R6)/7)","v":9},{"$f":"Configurações!N10","v":"10:00:00"},3.75,null,"Set",9,{"$f":"Configurações!K16","v":5.833333333333333},{"$f":"K26","v":0},{"$nulls":6},"Set",9,{"$f":"SUMPRODUCT((MONTH(Tabela5[Data])=AG14)*(Tabela5[Questões]))","v":0},{"$f":"SUMPRODUCT((MONTH(Tabela5[Data])=AG14)*(Tabela5[Acertos]))","v":0},0,"","","",null,{"$f":"SUMIF(Tabela5[],AP14,Tabela5[Questões])","v":0},{"$f":"Edital!C24","v":0},{"$nulls":9},"Out",10,{"$f":"IFERROR(SUMPRODUCT((MONTH(Tabela5[Data])=BA14)*(Tabela5[Matéria]=Rel_Exer!$C$22)*(Tabela5[Questões])),\"\")","v":0},{"$f":"IFERROR(SUMPRODUCT((MONTH(Tabela5[Data])=BA14)*(Tabela5[Matéria]=Rel_Exer!$C$22)*(Tabela5[Acertos])),\"\")","v":0},0,"",""]
[null,{"$f":"Edital!C24","v":0},{"$f":"IFERROR(SUMPRODUCT((MONTH(Tabela2[Data])=$C$5)*(Tabela2[Matéria]=B15)*Tabela2[Horas]),\"\")","v":0},{"$f":"IFERROR(SUMPRODUCT((MONTH(Tabela2[Data])=$D$5)*(Tabela2[Matéria]=B15)*Tabela2[Horas]),\"\")","v":0},{"$f":"IFERROR(SUMPRODUCT((MONTH(Tabela2[Data])=$E$5)*(Tabela2[Matéria]=B15)*Tabela2[Horas]),\"\")","v":0},{"$f":"IFERROR(SUMPRODUCT((MONTH(Tabela2[Data])=$F$5)*(Tabela2[Matéria]=B15)*Tabela2[Horas]),\"\")","v":0},{"$f":"IFERROR(SUMPRODUCT((MONTH(Tabela2[Data])=$G$5)*(Tabela2[Matéria]=B15)*Tabela2[Horas]),\"\")","v":0},{"$f":"IFERROR(SUMPRODUCT((MONTH(Tabela2[Data])=$H$5)*(Tabela2[Matéria]=B15)*Tabela2[Horas]),\"\")","v":0},{"$f":"IFERROR(SUMPRODUCT((MONTH(Tabela2[Data])=$I$5)*(Tabela2[Matéria]=B15)*Tabela2[Horas]),\"\")","v":0},{"$f":"IFERROR(SUMPRODUCT((MONTH(Tabela2[Data])=$J$5)*(Tabela2[Matéria]=B15)*Tabela2[Horas]),\"\")","v":0},{"$f":"IFERROR(SUMPRODUCT((MONTH(Tabela2[Data])=$K$5)*(Tabela2[Matéria]=B15)*Tabela2[Horas]),\"\")","v":0},{"$f":"IFERROR(SUMPRODUCT((MONTH(Tabela2[Data])=$L$5)*(Tabela2[Matéria]=B15)*Tabela2[Horas]),\"\")","v":0},{"$f":"IFERROR(SUMPRODUCT((MONTH(Tabela2[Data])=$M$5)*(Tabela2[Matéria]=B15)*Tabela2[Horas]),\"\")","v":0},{"$f":"IFERROR(SUMPRODUCT((MONTH(Tabela2[Data])=$N$5)*(Tabela2[Matéria]=B15)*Tabela2[Horas]),\"\")","v":0},{"$nulls":3},{"$f":"SUM(R8:R14)","v":60},null,{"$f":"IFERROR(SUM(T8:T14),\"\")","v":25},null,"Out",10,{"$f":"Configurações!K17","v":5.833333333333333},{"$f":"L26","v":0},{"$nulls":6},"Out",10,{"$f":"SUMPRODUCT((MONTH(Tabela5[Data])=AG15)*(Tabela5[Questões]))","v":0},{"$f":"SUMPRODUCT((MONTH(Tabela5[Data])=AG15)*(Tabela5[Acertos]))","v":0},0,"","","",null,{"$f":"SUMIF(Tabela5[],AP15,Tabela5[Questões])","v":0},{"$f":"Edital!C25","v":0},{"$nulls":9},"Nov",11,{"$f":"IFERROR(SUMPRODUCT((MONTH(Tabela5[Data])=BA15)*(Tabela5[Matéria]=Rel_Exer!$C$22)*(Tabela5[Questões])),\"\")","v":0},{"$f":"IFERROR(SUMPRODUCT((MONTH(Tabela5[Data])=BA15)*(Tabela5[Matéria]=Rel_Exer!$C$22)*(Tabela5[Acertos])),\"\")","v":0},0,"",""]
[null,{"$f":"Edital!C25","v":0},{"$f":"IFERROR(SUMPRODUCT((MONTH(Tabela2[Data])=$C$5)*(Tabela2[Matéria]=B16)*Tabela2[Horas]),\"\")","v":0},{"$f":"IFERROR(SUMPRODUCT((MONTH(Tabela2[Data])=$D$5)*(Tabela2[Matéria]=B16)*Tabela2[Horas]),\"\")","v":0},{"$f":"IFERROR(SUMPRODUCT((MONTH(Tabela2[Data])=$E$5)*(Tabela2[Matéria]=B16)*Tabela2[Horas]),\"\")","v":0},{"$f":"IFERROR(SUMPRODUCT((MONTH(Tabela2[Data])=$F$5)*(Tabela2[Matéria]=B16)*Tabela2[Horas]),\"\")","v":0},{"$f":"IFERROR(SUMPRODUCT((MONTH(Tabela2[Data])=$G$5)*(Tabela2[Matéria]=B16)*Tabela2[Horas]),\"\")","v":0},{"$f":"IFERROR(SUMPRODUCT((MONTH(Tabela2[Data])=$H$5)*(Tabela2[Matéria]=B16)*Tabela2[Horas]),\"\")","v":0},{"$f":"IFERROR(SUMPRODUCT((MONTH(Tabela2[Data])=$I$5)*(Tabela2[Matéria]=B16)*Tabela2[Horas]),\"\")","v":0},{"$f":"IFERROR(SUMPRODUCT((MONTH(Tabela2[Data])=$J$5)*(Tabela2[Matéria]=B16)*Tabela2[Horas]),\"\")","v":0},{"$f":"IFERROR(SUMPRODUCT((MONTH(Tabela2[Data])=$K$5)*(Tabela2[Matéria]=B16)*Tabela2[Horas]),\"\")","v":0},{"$f":"IFERROR(SUMPRODUCT((MONTH(Tabela2[Data])=$L$5)*(Tabela2[Matéria]=B16)*Tabela2[Horas]),\"\")","v":0},{"$f":"IFERROR(SUMPRODUCT((MONTH(Tabela2[Data])=$M$5)*(Tabela2[Matéria]=B16)*Tabela2[Horas]),\"\")","v":0},{"$f":"IFERROR(SUMPRODUCT((MONTH(Tabela2[Data])=$N$5)*(Tabela2[Matéria]=B16)*Tabela2[Horas]),\"\")","v":0},{"$nulls":7},"Nov",11,{"$f":"Configurações!K18","v":5.833333333333333},{"$f":"M26","v":0},{"$nulls":6},"Nov",11,{"$f":"SUMPRODUCT((MONTH(Tabela5[Data])=AG16)*(Tabela5[Questões]))","v":0},{"$f":"SUMPRODUCT((MONTH(Tabela5[Data])=AG16)*(Tabela5[Acertos]))","v":0},0,"","","",null,{"$f":"SUMIF(Tabela5[],AP16,Tabela5[Questões])","v":0},{"$f":"Edital!C26","v":0},{"$nulls":9},"Dez",12,{"$f":"IFERROR(SUMPRODUCT((MONTH(Tabela5[Data])=BA16)*(Tabela5[Matéria]=Rel_Exer!$C$22)*(Tabela5[Questões])),\"\")","v":10},{"$f":"IFERROR(SUMPRODUCT((MONTH(Tabela5[Data])=BA16)*(Tabela5[Matéria]=Rel_Exer!$C$22)*(Tabela5[Acertos])),\"\")","v":7},3,{"v":0.7,"d":"70%"},{"v":0.3,"d":"30%"}]
[null,{"$f":"Edital!C26","v":0},{"$f":"IFERROR(SUMPRODUCT((MONTH(Tabela2[Data])=$C$5)*(Tabela2[Matéria]=B17)*Tabela2[Horas]),\"\")","v":0},{"$f":"IFERROR(SUMPRODUCT((MONTH(Tabela2[Data])=$D$5)*(Tabela2[Matéria]=B17)*Tabela2[Horas]),\"\")","v":0},{"$f":"IFERROR(SUMPRODUCT((MONTH(Tabela2[Data])=$E$5)*(Tabela2[Matéria]=B17)*Tabela2[Horas]),\"\")","v":0},{"$f":"IFERROR(SUMPRODUCT((MONTH(Tabela2[Data])=$F$5)*(Tabela2[Matéria]=B17)*Tabela2[Horas]),\"\")","v":0},{"$f":"IFERROR(SUMPRODUCT((MONTH(Tabela2[Data])=$G$5)*(Tabela2[Matéria]=B17)*Tabela2[Horas]),\"\")","v":0},{"$f":"IFERROR(SUMPRODUCT((MONTH(Tabela2[Data])=$H$5)*(Tabela2[Matéria]=B17)*Tabela2[Horas]),\"\")","v":0},{"$f":"IFERROR(SUMPRODUCT((MONTH(Tabela2[Data])=$I$5)*(Tabela2[Matéria]=B17)*Tabela2[Horas]),\"\")","v":0},{"$f":"IFERROR(SUMPRODUCT((MONTH(Tabela2[Data])=$J$5)*(Tabela2[Matéria]=B17)*Tabela2[Horas]),\"\")","v":0},{"$f":"IFERROR(SUMPRODUCT((MONTH(Tabela2[Data])=$K$5)*(Tabela2[Matéria]=B17)*Tabela2[Horas]),\"\")","v":0},{"$f":"IFERROR(SUMPRODUCT((MONTH(Tabela2[Data])=$L$5)*(Tabela2[Matéria]=B17)*Tabela2[Horas]),\"\")","v":0},{"$f":"IFERROR(SUMPRODUCT((MONTH(Tabela2[Data])=$M$5)*(Tabela2[Matéria]=B17)*Tabela2[Horas]),\"\")","v":0},{"$f":"IFERROR(SUMPRODUCT((MONTH(Tabela2[Data])=$N$5)*(Tabela2[Matéria]=B17)*Tabela2[Horas]),\"\")","v":0},{"$nulls":7},"Dez",12,{"$f":"Configurações!K19","v":5.833333333333333},{"$f":"N26","v":0},{"$nulls":6},"Dez",12,{"$f":"SUMPRODUCT((MONTH(Tabela5[Data])=AG17)*(Tabela5[Questões]))","v":74},{"$f":"SUMPRODUCT((MONTH(Tabela5[Data])=AG17)*(Tabela5[Acertos]))","v":54},20,{"v":0.7297297297297297,"d":"73%"},{"v":0.7297297297297297,"d":"73%"},{"v":0.2702702702702703,"d":"27%"},null,{"$f":"SUMIF(Tabela5[],AP17,Tabela5[Questões])","v":0},{"$f":"Edital!C27","v":0}]
[null,{"$f":"Edital!C27","v":0},{"$f":"IFERROR(SUMPRODUCT((MONTH(Tabela2[Data])=$C$5)*(Tabela2[Matéria]=B18)*Tabela2[Horas]),\"\")","v":0},{"$f":"IFERROR(SUMPRODUCT((MONTH(Tabela2[Data])=$D$5)*(Tabela2[Matéria]=B18)*Tabela2[Horas]),\"\")","v":0},{"$f":"IFERROR(SUMPRODUCT((MONTH(Tabela2[Data])=$E$5)*(Tabela2[Matéria]=B18)*Tabela2[Horas]),\"\")","v":0},{"$f":"IFERROR(SUMPRODUCT((MONTH(Tabela2[Data])=$F$5)*(Tabela2[Matéria]=B18)*Tabela2[Horas]),\"\")","v":0},{"$f":"IFERROR(SUMPRODUCT((MONTH(Tabela2[Data])=$G$5)*(Tabela2[Matéria]=B18)*Tabela2[Horas]),\"\")","v":0},{"$f":"IFERROR(SUMPRODUCT((MONTH(Tabela2[Data])=$H$5)*(Tabela2[Matéria]=B18)*Tabela2[Horas]),\"\")","v":0},{"$f":"IFERROR(SUMPRODUCT((MONTH(Tabela2[Data])=$I$5)*(Tabela2[Matéria]=B18)*Tabela2[Horas]),\"\")","v":0},{"$f":"IFERROR(SUMPRODUCT((MONTH(Tabela2[Data])=$J$5)*(Tabela2[Matéria]=B18)*Tabela2[Horas]),\"\")","v":0},{"$f":"IFERROR(SUMPRODUCT((MONTH(Tabela2[Data])=$K$5)*(Tabela2[Matéria]=B18)*Tabela2[Horas]),\"\")","v":0},{"$f":"IFERROR(SUMPRODUCT((MONTH(Tabela2[Data])=$L$5)*(Tabela2[Matéria]=B18)*Tabela2[Horas]),\"\")","v":0},{"$f":"IFERROR(SUMPRODUCT((MONTH(Tabela2[Data])=$M$5)*(Tabela2[Matéria]=B18)*Tabela2[Horas]),\"\")","v":0},{"$f":"IFERROR(SUMPRODUCT((MONTH(Tabela2[Data])=$N$5)*(Tabela2[Matéria]=B18)*Tabela2[Horas]),\"\")","v":0},{"$nulls":26},{"$f":"SUMIF(Tabela5[],AP18,Tabela5[Questões])","v":0},{"$f":"Edital!C28","v":0}]
[null,{"$f":"Edital!C28","v":0},{"$f":"IFERROR(SUMPRODUCT((MONTH(Tabela2[Data])=$C$5)*(Tabela2[Matéria]=B19)*Tabela2[Horas]),\"\")","v":0},{"$f":"IFERROR(SUMPRODUCT((MONTH(Tabela2[Data])=$D$5)*(Tabela2[Matéria]=B19)*Tabela2[Horas]),\"\")","v":0},{"$f":"IFERROR(SUMPRODUCT((MONTH(Tabela2[Data])=$E$5)*(Tabela2[Matéria]=B19)*Tabela2[Horas]),\"\")","v":0},{"$f":"IFERROR(SUMPRODUCT((MONTH(Tabela2[Data])=$F$5)*(Tabela2[Matéria]=B19)*Tabela2[Horas]),\"\")","v":0},{"$f":"IFERROR(SUMPRODUCT((MONTH(Tabela2[Data])=$G$5)*(Tabela2[Matéria]=B19)*Tabela2[Horas]),\"\")","v":0},{"$f":"IFERROR(SUMPRODUCT((MONTH(Tabela2[Data])=$H$5)*(Tabela2[Matéria]=B19)*Tabela2[Horas]),\"\")","v":0},{"$f":"IFERROR(SUMPRODUCT((MONTH(Tabela2[Data])=$I$5)*(Tabela2[Matéria]=B19)*Tabela2[Horas]),\"\")","v":0},{"$f":"IFERROR(SUMPRODUCT((MONTH(Tabela2[Data])=$J$5)*(Tabela2[Matéria]=B19)*Tabela2[Horas]),\"\")","v":0},{"$f":"IFERROR(SUMPRODUCT((MONTH(Tabela2[Data])=$K$5)*(Tabela2[Matéria]=B19)*Tabela2[Horas]),\"\")","v":0},{"$f":"IFERROR(SUMPRODUCT((MONTH(Tabela2[Data])=$L$5)*(Tabela2[Matéria]=B19)*Tabela2[Horas]),\"\")","v":0},{"$f":"IFERROR(SUMPRODUCT((MONTH(Tabela2[Data])=$M$5)*(Tabela2[Matéria]=B19)*Tabela2[Horas]),\"\")","v":0},{"$f":"IFERROR(SUMPRODUCT((MONTH(Tabela2[Data])=$N$5)*(Tabela2[Matéria]=B19)*Tabela2[Horas]),\"\")","v":0},{"$nulls":17},"Simulados",{"$nulls":8},{"$f":"SUMIF(Tabela5[],AP19,Tabela5[Questões])","v":0},{"$f":"Edital!C29","v":0}]
[null,{"$f":"Edital!C29","v":0},{"$f":"IFERROR(SUMPRODUCT((MONTH(Tabela2[Data])=$C$5)*(Tabela2[Matéria]=B20)*Tabela2[Horas]),\"\")","v":0},{"$f":"IFERROR(SUMPRODUCT((MONTH(Tabela2[Data])=$D$5)*(Tabela2[Matéria]=B20)*Tabela2[Horas]),\"\")","v":0},{"$f":"IFERROR(SUMPRODUCT((MONTH(Tabela2[Data])=$E$5)*(Tabela2[Matéria]=B20)*Tabela2[Horas]),\"\")","v":0},{"$f":"IFERROR(SUMPRODUCT((MONTH(Tabela2[Data])=$F$5)*(Tabela2[Matéria]=B20)*Tabela2[Horas]),\"\")","v":0},{"$f":"IFERROR(SUMPRODUCT((MONTH(Tabela2[Data])=$G$5)*(Tabela2[Matéria]=B20)*Tabela2[Horas]),\"\")","v":0},{"$f":"IFERROR(SUMPRODUCT((MONTH(Tabela2[Data])=$H$5)*(Tabela2[Matéria]=B20)*Tabela2[Horas]),\"\")","v":0},{"$f":"IFERROR(SUMPRODUCT((MONTH(Tabela2[Data])=$I$5)*(Tabela2[Matéria]=B20)*Tabela2[Horas]),\"\")","v":0},{"$f":"IFERROR(SUMPRODUCT((MONTH(Tabela2[Data])=$J$5)*(Tabela2[Matéria]=B20)*Tabela2[Horas]),\"\")","v":0},{"$f":"IFERROR(SUMPRODUCT((MONTH(Tabela2[Data])=$K$5)*(Tabela2[Matéria]=B20)*Tabela2[Horas]),\"\")","v":0},{"$f":"IFERROR(SUMPRODUCT((MONTH(Tabela2[Data])=$L$5)*(Tabela2[Matéria]=B20)*Tabela2[Horas]),\"\")","v":0},{"$f":"IFERROR(SUMPRODUCT((MONTH(Tabela2[Data])=$M$5)*(Tabela2[Matéria]=B20)*Tabela2[Horas]),\"\")","v":0},{"$f":"IFERROR(SUMPRODUCT((MONTH(Tabela2[Data])=$N$5)*(Tabela2[Matéria]=B20)*Tabela2[Horas]),\"\")","v":0},{"$nulls":26},{"$f":"SUMIF(Tabela5[],AP20,Tabela5[Questões])","v":0},{"$f":"Edital!C30","v":0}]
[null,{"$f":"Edital!C30","v":0},{"$f":"IFERROR(SUMPRODUCT((MONTH(Tabela2[Data])=$C$5)*(Tabela2[Matéria]=B21)*Tabela2[Horas]),\"\")","v":0},{"$f":"IFERROR(SUMPRODUCT((MONTH(Tabela2[Data])=$D$5)*(Tabela2[Matéria]=B21)*Tabela2[Horas]),\"\")","v":0},{"$f":"IFERROR(SUMPRODUCT((MONTH(Tabela2[Data])=$E$5)*(Tabela2[Matéria]=B21)*Tabela2[Horas]),\"\")","v":0},{"$f":"IFERROR(SUMPRODUCT((MONTH(Tabela2[Data])=$F$5)*(Tabela2[Matéria]=B21)*Tabela2[Horas]),\"\")","v":0},{"$f":"IFERROR(SUMPRODUCT((MONTH(Tabela2[Data])=$G$5)*(Tabela2[Matéria]=B21)*Tabela2[Horas]),\"\")","v":0},{"$f":"IFERROR(SUMPRODUCT((MONTH(Tabela2[Data])=$H$5)*(Tabela2[Matéria]=B21)*Tabela2[Horas]),\"\")","v":0},{"$f":"IFERROR(SUMPRODUCT((MONTH(Tabela2[Data])=$I$5)*(Tabela2[Matéria]=B21)*Tabela2[Horas]),\"\")","v":0},{"$f":"IFERROR(SUMPRODUCT((MONTH(Tabela2[Data])=$J$5)*(Tabela2[Matéria]=B21)*Tabela2[Horas]),\"\")","v":0},{"$f":"IFERROR(SUMPRODUCT((MONTH(Tabela2[Data])=$K$5)*(Tabela2[Matéria]=B21)*Tabela2[Horas]),\"\")","v":0},{"$f":"IFERROR(SUMPRODUCT((MONTH(Tabela2[Data])=$L$5)*(Tabela2[Matéria]=B21)*Tabela2[Horas]),\"\")","v":0},{"$f":"IFERROR(SUMPRODUCT((MONTH(Tabela2[Data])=$M$5)*(Tabela2[Matéria]=B21)*Tabela2[Horas]),\"\")","v":0},{"$f":"IFERROR(SUMPRODUCT((MONTH(Tabela2[Data])=$N$5)*(Tabela2[Matéria]=B21)*Tabela2[Horas]),\"\")","v":0},{"$nulls":17},"Simulado","Banca","Média",{"$nulls":6},{"$f":"SUMIF(Tabela5[],AP21,Tabela5[Questões])","v":0},{"$f":"Edital!C31","v":0}]
[null,{"$f":"Edital!C31","v":0},{"$f":"IFERROR(SUMPRODUCT((MONTH(Tabela2[Data])=$C$5)*(Tabela2[Matéria]=B22)*Tabela2[Horas]),\"\")","v":0},{"$f":"IFERROR(SUMPRODUCT((MONTH(Tabela2[Data])=$D$5)*(Tabela2[Matéria]=B22)*Tabela2[Horas]),\"\")","v":0},{"$f":"IFERROR(SUMPRODUCT((MONTH(Tabela2[Data])=$E$5)*(Tabela2[Matéria]=B22)*Tabela2[Horas]),\"\")","v":0},{"$f":"IFERROR(SUMPRODUCT((MONTH(Tabela2[Data])=$F$5)*(Tabela2[Matéria]=B22)*Tabela2[Horas]),\"\")","v":0},{"$f":"IFERROR(SUMPRODUCT((MONTH(Tabela2[Data])=$G$5)*(Tabela2[Matéria]=B22)*Tabela2[Horas]),\"\")","v":0},{"$f":"IFERROR(SUMPRODUCT((MONTH(Tabela2[Data])=$H$5)*(Tabela2[Matéria]=B22)*Tabela2[Horas]),\"\")","v":0},{"$f":"IFERROR(SUMPRODUCT((MONTH(Tabela2[Data])=$I$5)*(Tabela2[Matéria]=B22)*Tabela2[Horas]),\"\")","v":0},{"$f":"IFERROR(SUMPRODUCT((MONTH(Tabela2[Data])=$J$5)*(Tabela2[Matéria]=B22)*Tabela2[Horas]),\"\")","v":0},{"$f":"IFERROR(SUMPRODUCT((MONTH(Tabela2[Data])=$K$5)*(Tabela2[Matéria]=B22)*Tabela2[Horas]),\"\")","v":0},{"$f":"IFERROR(SUMPRODUCT((MONTH(Tabela2[Data])=$L$5)*(Tabela2[Matéria]=B22)*Tabela2[Horas]),\"\")","v":0},{"$f":"IFERROR(SUMPRODUCT((MONTH(Tabela2[Data])=$M$5)*(Tabela2[Matéria]=B22)*Tabela2[Horas]),\"\")","v":0},{"$f":"IFERROR(SUMPRODUCT((MONTH(Tabela2[Data])=$N$5)*(Tabela2[Matéria]=B22)*Tabela2[Horas]),\"\")","v":0},{"$nulls":17},{"$f":"Simulados!D5","v":"SIMULADO 1"},{"$f":"Simulados!F7","v":"VUNESP"},{"$f":"Simulados!F9","v":""},{"$f":"AF22&\" - \"&AG22","v":"SIMULADO 1 - VUNESP"},{"$nulls":5},{"$f":"SUMIF(Tabela5[],AP22,Tabela5[Questões])","v":0},{"$f":"Edital!C32","v":0}]
[null,{"$f":"Edital!C32","v":0},{"$f":"IFERROR(SUMPRODUCT((MONTH(Tabela2[Data])=$C$5)*(Tabela2[Matéria]=B23)*Tabela2[Horas]),\"\")","v":0},{"$f":"IFERROR(SUMPRODUCT((MONTH(Tabela2[Data])=$D$5)*(Tabela2[Matéria]=B23)*Tabela2[Horas]),\"\")","v":0},{"$f":"IFERROR(SUMPRODUCT((MONTH(Tabela2[Data])=$E$5)*(Tabela2[Matéria]=B23)*Tabela2[Horas]),\"\")","v":0},{"$f":"IFERROR(SUMPRODUCT((MONTH(Tabela2[Data])=$F$5)*(Tabela2[Matéria]=B23)*Tabela2[Horas]),\"\")","v":0},{"$f":"IFERROR(SUMPRODUCT((MONTH(Tabela2[Data])=$G$5)*(Tabela2[Matéria]=B23)*Tabela2[Horas]),\"\")","v":0},{"$f":"IFERROR(SUMPRODUCT((MONTH(Tabela2[Data])=$H$5)*(Tabela2[Matéria]=B23)*Tabela2[Horas]),\"\")","v":0},{"$f":"IFERROR(SUMPRODUCT((MONTH(Tabela2[Data])=$I$5)*(Tabela2[Matéria]=B23)*Tabela2[Horas]),\"\")","v":0},{"$f":"IFERROR(SUMPRODUCT((MONTH(Tabela2[Data])=$J$5)*(Tabela2[Matéria]=B23)*Tabela2[Horas]),\"\")","v":0},{"$f":"IFERROR(SUMPRODUCT((MONTH(Tabela2[Data])=$K$5)*(Tabela2[Matéria]=B23)*Tabela2[Horas]),\"\")","v":0},{"$f":"IFERROR(SUMPRODUCT((MONTH(Tabela2[Data])=$L$5)*(Tabela2[Matéria]=B23)*Tabela2[Horas]),\"\")","v":0},{"$f":"IFERROR(SUMPRODUCT((MONTH(Tabela2[Data])=$M$5)*(Tabela2[Matéria]=B23)*Tabela2[Horas]),\"\")","v":0},{"$f":"IFERROR(SUMPRODUCT((MONTH(Tabela2[Data])=$N$5)*(Tabela2[Matéria]=B23)*Tabela2[Horas]),\"\")","v":0},{"$nulls":17},{"$f":"Simulados!J5","v":"SIMULADO 2"},{"$f":"Simulados!L7","v":{"v":0,"d":"0%"}},{"$f":"Simulados!L9","v":""},{"$f":"AF23&\" - \"&AG23","v":"SIMULADO 2 - 0"},{"$nulls":5},{"$f":"SUMIF(Tabela5[],AP23,Tabela5[Questões])","v":0},{"$f":"Edital!C33","v":0}]
[null,{"$f":"Edital!C33","v":0},{"$f":"IFERROR(SUMPRODUCT((MONTH(Tabela2[Data])=$C$5)*(Tabela2[Matéria]=B24)*Tabela2[Horas]),\"\")","v":0},{"$f":"IFERROR(SUMPRODUCT((MONTH(Tabela2[Data])=$D$5)*(Tabela2[Matéria]=B24)*Tabela2[Horas]),\"\")","v":0},{"$f":"IFERROR(SUMPRODUCT((MONTH(Tabela2[Data])=$E$5)*(Tabela2[Matéria]=B24)*Tabela2[Horas]),\"\")","v":0},{"$f":"IFERROR(SUMPRODUCT((MONTH(Tabela2[Data])=$F$5)*(Tabela2[Matéria]=B24)*Tabela2[Horas]),\"\")","v":0},{"$f":"IFERROR(SUMPRODUCT((MONTH(Tabela2[Data])=$G$5)*(Tabela2[Matéria]=B24)*Tabela2[Horas]),\"\")","v":0},{"$f":"IFERROR(SUMPRODUCT((MONTH(Tabela2[Data])=$H$5)*(Tabela2[Matéria]=B24)*Tabela2[Horas]),\"\")","v":0},{"$f":"IFERROR(SUMPRODUCT((MONTH(Tabela2[Data])=$I$5)*(Tabela2[Matéria]=B24)*Tabela2[Horas]),\"\")","v":0},{"$f":"IFERROR(SUMPRODUCT((MONTH(Tabela2[Data])=$J$5)*(Tabela2[Matéria]=B24)*Tabela2[Horas]),\"\")","v":0},{"$f":"IFERROR(SUMPRODUCT((MONTH(Tabela2[Data])=$K$5)*(Tabela2[Matéria]=B24)*Tabela2[Horas]),\"\")","v":0},{"$f":"IFERROR(SUMPRODUCT((MONTH(Tabela2[Data])=$L$5)*(Tabela2[Matéria]=B24)*Tabela2[Horas]),\"\")","v":0},{"$f":"IFERROR(SUMPRODUCT((MONTH(Tabela2[Data])=$M$5)*(Tabela2[Matéria]=B24)*Tabela2[Horas]),\"\")","v":0},{"$f":"IFERROR(SUMPRODUCT((MONTH(Tabela2[Data])=$N$5)*(Tabela2[Matéria]=B24)*Tabela2[Horas]),\"\")","v":0},{"$nulls":17},{"$f":"Simulados!P5","v":"SIMULADO 3"},{"$f":"Simulados!R7","v":{"v":0,"d":"0%"}},{"$f":"Simulados!R9","v":""},"SIMULADO 3 - 0",{"$nulls":5},{"$f":"SUMIF(Tabela5[],AP24,Tabela5[Questões])","v":0},{"$f":"Edital!C34","v":0}]
[null,{"$f":"Edital!C34","v":0},{"$f":"IFERROR(SUMPRODUCT((MONTH(Tabela2[Data])=$C$5)*(Tabela2[Matéria]=B25)*Tabela2[Horas]),\"\")","v":0},{"$f":"IFERROR(SUMPRODUCT((MONTH(Tabela2[Data])=$D$5)*(Tabela2[Matéria]=B25)*Tabela2[Horas]),\"\")","v":0},{"$f":"IFERROR(SUMPRODUCT((MONTH(Tabela2[Data])=$E$5)*(Tabela2[Matéria]=B25)*Tabela2[Horas]),\"\")","v":0},{"$f":"IFERROR(SUMPRODUCT((MONTH(Tabela2[Data])=$F$5)*(Tabela2[Matéria]=B25)*Tabela2[Horas]),\"\")","v":0},{"$f":"IFERROR(SUMPRODUCT((MONTH(Tabela2[Data])=$G$5)*(Tabela2[Matéria]=B25)*Tabela2[Horas]),\"\")","v":0},{"$f":"IFERROR(SUMPRODUCT((MONTH(Tabela2[Data])=$H$5)*(Tabela2[Matéria]=B25)*Tabela2[Horas]),\"\")","v":0},{"$f":"IFERROR(SUMPRODUCT((MONTH(Tabela2[Data])=$I$5)*(Tabela2[Matéria]=B25)*Tabela2[Horas]),\"\")","v":0},{"$f":"IFERROR(SUMPRODUCT((MONTH(Tabela2[Data])=$J$5)*(Tabela2[Matéria]=B25)*Tabela2[Horas]),\"\")","v":0},{"$f":"IFERROR(SUMPRODUCT((MONTH(Tabela2[Data])=$K$5)*(Tabela2[Matéria]=B25)*Tabela2[Horas]),\"\")","v":0},{"$f":"IFERROR(SUMPRODUCT((MONTH(Tabela2[Data])=$L$5)*(Tabela2[Matéria]=B25)*Tabela2[Horas]),\"\")","v":0},{"$f":"IFERROR(SUMPRODUCT((MONTH(Tabela2[Data])=$M$5)*(Tabela2[Matéria]=B25)*Tabela2[Horas]),\"\")","v":0},{"$f":"IFERROR(SUMPRODUCT((MONTH(Tabela2[Data])=$N$5)*(Tabela2[Matéria]=B25)*Tabela2[Horas]),\"\")","v":0},{"$nulls":17},{"$f":"Simulados!V5","v":"SIMULADO 4"},{"$f":"Simulados!X7","v":{"v":0,"d":"0%"}},{"$f":"Simulados!X9","v":""},"SIMULADO 4 - 0"]
[null,{"$f":"IFERROR(SUM(C26:N26),\"\")","v":0},{"$f":"IFERROR(SUM(C6:C25),\"\")","v":0},{"$f":"IFERROR(SUM(D6:D25),\"\")","v":0},0,0,0,0,0,0,0,0,0,0,{"$nulls":17},{"$f":"Simulados!AB5","v":"SIMULADO 5"},{"$f":"Simulados!AD7","v":{"v":0,"d":"0%"}},{"$f":"Simulados!AD9","v":""},"SIMULADO 5 - 0"]
[{"$nulls":31},{"$f":"Simulados!AH5","v":"SIMULADO 6"},{"$f":"Simulados!AJ7","v":{"v":0,"d":"0%"}},{"$f":"Simulados!AJ9","v":""},"SIMULADO 6 - 0"]
[null,"Total de questões resolvidas por matéria",{"$nulls":29},{"$f":"Simulados!AN5","v":"SIMULADO 7"},{"$f":"Simulados!AP7","v":{"v":0,"d":"0%"}},{"$f":"Simulados!AP9","v":""},"SIMULADO 7 - 0"]
[null,"Matéria x Mês",1,2,3,4,5,6,7,8,9,10,11,12,"Total Horas x Ano",{"$nulls":16},{"$f":"Simulados!AT5","v":"SIMULADO 8"},{"$f":"Simulados!AV7","v":{"v":0,"d":"0%"}},{"$f":"Simulados!AV9","v":""},"SIMULADO 8 - 0"]
[{"$nulls":31},{"$f":"Simulados!AZ5","v":"SIMULADO 9"},{"$f":"Simulados!BB7","v":{"v":0,"d":"0%"}},{"$f":"Simulados!BB9","v":""},"SIMULADO 9 - 0"]
[{"$nulls":31},{"$f":"Simulados!BF5","v":"SIMULADO 10"},{"$f":"Simulados!BH7","v":{"v":0,"d":"0%"}},{"$f":"Simulados!BH9","v":""},"SIMULADO 10 - 0"]
[{"$nulls":31},{"$f":"Simulados!BL5","v":"SIMULADO 11"},{"$f":"Simulados!BN7","v":{"v":0,"d":"0%"}},{"$f":"Simulados!BN9","v":""},"SIMULADO 11 - 0"]
[{"$nulls":31},{"$f":"Simulados!BR5","v":"SIMULADO 12"},{"$f":"Simulados!BT7","v":{"v":0,"d":"0%"}},{"$f":"Simulados!BT9","v":""},"SIMULADO 12 - 0"]
[{"$nulls":31},{"$f":"Simulados!BX5","v":"SIMULADO 13"},{"$f":"Simulados!BZ7","v":{"v":0,"d":"0%"}},{"$f":"Simulados!BZ9","v":""},"SIMULADO 13 - 0"]
[{"$nulls":31},{"$f":"Simulados!CD5","v":"SIMULADO 14"},{"$f":"Simulados!CF7","v":{"v":0,"d":"0%"}},{"$f":"Simulados!CF9","v":""},"SIMULADO 14 - 0"]
[{"$nulls":31},{"$f":"Simulados!CJ5","v":"SIMULADO 15"},{"$f":"Simulados!CL7","v":{"v":0,"d":"0%"}},{"$f":"Simulados!CL9","v":""},"SIMULADO 15 - 0"]
[{"$nulls":31},{"$f":"Simulados!CP5","v":"SIMULADO 16"},{"$f":"Simulados!CR7","v":{"v":0,"d":"0%"}},{"$f":"Simulados!CR9","v":""},"SIMULADO 16 - 0"]
[{"$nulls":31},{"$f":"Simulados!CV5","v":"SIMULADO 17"},{"$f":"Simulados!CX7","v":{"v":0,"d":"0%"}},{"$f":"Simulados!CX9","v":""},"SIMULADO 17 - 0"]
[{"$nulls":31},{"$f":"Simulados!DB5","v":"SIMULADO 18"},{"$f":"Simulados!DD7","v":{"v":0,"d":"0%"}},{"$f":"Simulados!DD9","v":""},"SIMULADO 18 - 0"]
[{"$nulls":31},{"$f":"Simulados!DH5","v":"SIMULADO 19"},{"$f":"Simulados!DJ7","v":{"v":0,"d":"0%"}},{"$f":"Simulados!DJ9","v":""},"SIMULADO 19 - 0"]
[{"$nulls":31},{"$f":"Simulados!DN5","v":"SIMULADO 20"},{"$f":"Simulados!DP7","v":{"v":0,"d":"0%"}},{"$f":"Simulados!DP9","v":""},"SIMULADO 20 - 0"]

{"sheet":"1","index":19,"n_rows":259,"n_cols":16,"rows_kept":259,"merged":[[6,1,6,2],[6,6,6,12],[8,1,8,2]]}
[]
[]
[]
[{"$nulls":10},"Assuntos","Finalizado","Pendentes"]
[{"$nulls":10},{"$f":"COUNTA(O10:O259)","v":2},{"$f":"COUNTIF(O10:O259,\"Sim\")","v":1},{"$f":"K5-L5","v":1},null,{"$f":"L5/K5","v":{"v":0.5,"d":"50%"}}]
[]
[null,{"$f":"Edital!C15","v":"LÍNGUA PORTUGUESA"},null,null,"Teoria",null,"Revisões",{"$nulls":7},"Teoria",{"$f":"COUNTIF($P$10:$P$259,\"<>0\")","v":0}]
[]
[null,"Assuntos",null,null,"Data estudo",null,1,7,15,30,60,90,140,null,"Finalizei o assunto?"]
[null,"SUBTÓPICO",{"$nulls":4},{"$f":"IF($E10=\"\",\"\",$E10+$G$9)","v":""},{"$f":"IF($E10=\"\",\"\",$E10+$H$9)","v":""},{"$f":"IF($E10=\"\",\"\",$E10+$I$9)","v":""},{"$f":"IF($E10=\"\",\"\",$E10+$J$9)","v":""},{"$f":"IF($E10=\"\",\"\",$E10+$K$9)","v":""},{"$f":"IF($E10=\"\",\"\",$E10+$L$9)","v":""},{"$f":"IF($E10=\"\",\"\",$E10+$M$9)","v":""},null,null,{"$f":"IFERROR(IF(G10=TODAY(),\"1\",IF(H10=TODAY(),\"1\",IF(I10=TODAY(),\"1\",IF(J10=TODAY(),\"1\",IF(K10=TODAY(),\"1\",IF(L10=TODAY(),\"1\",IF(M10=TODAY(),\"1\",))))))),\"\")","v":0}]
[null,null,"PONTUAÇÃO",null,"2018-12-15",null,"2018-12-16","2018-12-22","2018-12-30","2019-01-14","2019-02-13","2019-03-15","2019-05-04",null,"Sim",{"$f":"IFERROR(IF(G11=TODAY(),\"1\",IF(H11=TODAY(),\"1\",IF(I11=TODAY(),\"1\",IF(J11=TODAY(),\"1\",IF(K11=TODAY(),\"1\",IF(L11=TODAY(),\"1\",IF(M11=TODAY(),\"1\",))))))),\"\")","v":0}]
[null,null,"SINTAXE",null,"2018-12-16",null,"2018-12-17","2018-12-23","2018-12-31","2019-01-15","2019-02-14","2019-03-16","2019-05-05",null,"Não",{"$f":"IFERROR(IF(G12=TODAY(),\"1\",IF(H12=TODAY(),\"1\",IF(I12=TODAY(),\"1\",IF(J12=TODAY(),\"1\",IF(K12=TODAY(),\"1\",IF(L12=TODAY(),\"1\",IF(M12=TODAY(),\"1\",))))))),\"\")","v":0}]
[{"$nulls":6},"","","","","","","",null,null,0]
[{"$nulls":6},"","","","","","","",null,null,0]
[{"$nulls":6},"","","","","","","",null,null,0]
[{"$nulls":6},"","","","","","","",null,null,0]
[{"$nulls":6},"","","","","","","",null,null,0]
[{"$nulls":6},"","","","","","","",null,null,0]
[{"$nulls":6},"","","","","","","",null,null,0]
[{"$nulls":6},"","","","","","","",null,null,0]
[{"$nulls":6},"","","","","","","",null,null,0]
[{"$nulls":6},"","","","","","","",null,null,0]
[{"$nulls":6},"","","","","","","",null,null,0]
[{"$nulls":6},"","","","","","","",null,null,0]
[{"$nulls":6},"","","","","","","",null,null,0]
[{"$nulls":6},"","","","","","","",null,null,0]
[{"$nulls":6},"","","","","","","",null,null,0]
[{"$nulls":6},"","","","","","","",null,null,0]
[{"$nulls":6},"","","","","","","",null,null,0]
[{"$nulls":6},"","","","","","","",null,null,0]
[{"$nulls":6},"","","","","","","",null,null,0]
[{"$nulls":6},"","","","","","","",null,null,0]
[{"$nulls":6},"","","","","","","",null,null,0]
[{"$nulls":6},"","","","","","","",null,null,0]
[{"$nulls":6},"","","","","","","",null,null,0]
[{"$nulls":6},"","","","","","","",null,null,0]
[{"$nulls":6},"","","","","","","",null,null,0]
[{"$nulls":6},"","","","","","","",null,null,0]
[{"$nulls":6},"","","","","","","",null,null,0]
[{"$nulls":6},"","","","","","","",null,null,0]
[{"$nulls":6},"","","","","","","",null,null,0]
[{"$nulls":6},"","","","","","","",null,null,0]
[{"$nulls":6},"","","","","","","",null,null,0]
[{"$nulls":6},"","","","","","","",null,null,0]
[{"$nulls":6},"","","","","","","",null,null,0]
[{"$nulls":6},"","","","","","","",null,null,0]
[{"$nulls":6},"","","","","","","",null,null,0]
[{"$nulls":6},"","","","","","","",null,null,0]
[{"$nulls":6},"","","","","","","",null,null,0]
[{"$nulls":6},"","","","","","","",null,null,0]
[{"$nulls":6},"","","","","","","",null,null,0]
[{"$nulls":6},"","","","","","","",null,null,0]
[{"$nulls":6},"","","","","","","",null,null,0]
[{"$nulls":6},"","","","","","","",null,null,0]
[{"$nulls":6},"","","","","","","",null,null,0]
[{"$nulls":6},"","","","","","","",null,null,0]
[{"$nulls":6},"","","","","","","",null,null,0]
[{"$nulls":6},"","","","","","","",null,null,0]
[{"$nulls":6},"","","","","","","",null,null,0]
[{"$nulls":6},"","","","","","","",null,null,0]
[{"$nulls":6},"","","","","","","",null,null,0]
[{"$nulls":6},"","","","","","","",null,null,0]
[{"$nulls":6},"","","","","","","",null,null,0]
[{"$nulls":6},"","","","","","","",null,null,0]
[{"$nulls":6},"","","","","","","",null,null,0]
[{"$nulls":6},"","","","","","","",null,null,0]
[{"$nulls":6},"","","","","","","",null,null,0]
[{"$nulls":6},"","","","","","","",null,null,0]
[{"$nulls":6},"","","","","","","",null,null,0]
[{"$nulls":6},"","","","","","","",null,null,0]
[{"$nulls":6},"","","","","","","",null,null,0]
[{"$nulls":6},"","","","","","","",null,null,0]
[{"$nulls":6},"","","","","","","",null,null,0]
[{"$nulls":6},{"$f":"IF($E74=\"\",\"\",$E74+$G$9)","v":""},{"$f":"IF($E74=\"\",\"\",$E74+$H$9)","v":""},{"$f":"IF($E74=\"\",\"\",$E74+$I$9)","v":""},{"$f":"IF($E74=\"\",\"\",$E74+$J$9)","v":""},{"$f":"IF($E74=\"\",\"\",$E74+$K$9)","v":""},{"$f":"IF($E74=\"\",\"\",$E74+$L$9)","v":""},{"$f":"IF($E74=\"\",\"\",$E74+$M$9)","v":""},null,null,0]
[{"$nulls":6},"","","","","","","",null,null,0]
[{"$nulls":6},"","","","","","","",null,null,{"$f":"IFERROR(IF(G76=TODAY(),\"1\",IF(H76=TODAY(),\"1\",IF(I76=TODAY(),\"1\",IF(J76=TODAY(),\"1\",IF(K76=TODAY(),\"1\",IF(L76=TODAY(),\"1\",IF(M76=TODAY(),\"1\",))))))),\"\")","v":0}]
[{"$nulls":6},"","","","","","","",null,null,0]
[{"$nulls":6},"","","","","","","",null,null,0]
[{"$nulls":6},"","","","","","","",null,null,0]
[{"$nulls":6},"","","","","","","",null,null,0]
[{"$nulls":6},"","","","","","","",null,null,0]
[{"$nulls":6},"","","","","","","",null,null,0]
[{"$nulls":6},"","","","","","","",null,null,0]
[{"$nulls":6},"","","","","","","",null,null,0]
[{"$nulls":6},"","","","","","","",null,null,0]
[{"$nulls":6},"","","","","","","",null,null,0]
[{"$nulls":6},"","","","","","","",null,null,0]
[{"$nulls":6},"","","","","","","",null,null,0]
[{"$nulls":6},"","","","","","","",null,null,0]
[{"$nulls":6},"","","","","","","",null,null,0]
[{"$nulls":6},"","","","","","","",null,null,0]
[{"$nulls":6},"","","","","","","",null,null,0]
[{"$nulls":6},"","","","","","","",null,null,0]
[{"$nulls":6},"","","","","","","",null,null,0]
[{"$nulls":6},"","","","","","","",null,null,0]
[{"$nulls":6},"","","","","","","",null,null,0]
[{"$nulls":6},"","","","","","","",null,null,0]
[{"$nulls":6},"","","","","","","",null,null,0]
[{"$nulls":6},"","","","","","","",null,null,0]
[{"$nulls":6},"","","","","","","",null,null,0]
[{"$nulls":6},"","","","","","","",null,null,0]
[{"$nulls":6},"","","","","","","",null,null,0]
[{"$nulls":6},"","","","","","","",null,null,0]
[{"$nulls":6},"","","","","","","",null,null,0]
[{"$nulls":6},"","","","","","","",null,null,0]
[{"$nulls":6},"","","","","","","",null,null,0]
[{"$nulls":6},"","","","","","","",null,null,0]
[{"$nulls":6},"","","","","","","",null,null,0]
[{"$nulls":6},"","","","","","","",null,null,0]
[{"$nulls":6},"","","","","","","",null,null,0]
[{"$nulls":6},"","","","","","","",null,null,0]
[{"$nulls":6},"","","","","","","",null,null,0]
[{"$nulls":6},"","","","","","","",null,null,0]
[{"$nulls":6},"","","","","","","",null,null,0]
[{"$nulls":6},"","","","","","","",null,null,0]
[{"$nulls":6},"","","","","","","",null,null,0]
[{"$nulls":6},"","","","","","","",null,null,0]
[{"$nulls":6},"","","","","","","",null,null,0]
[{"$nulls":6},"","","","","","","",null,null,0]
[{"$nulls":6},"","","","","","","",null,null,0]
[{"$nulls":6},"","","","","","","",null,null,0]
[{"$nulls":6},"","","","","","","",null,null,0]
[{"$nulls":6},"","","","","","","",null,null,0]
[{"$nulls":6},"","","","","","","",null,null,0]
[{"$nulls":6},"","","","","","","",null,null,0]
[{"$nulls":6},"","","","","","","",null,null,0]
[{"$nulls":6},"","","","","","","",null,null,0]
[{"$nulls":6},"","","","","","","",null,null,0]
[{"$nulls":6},"","","","","","","",null,null,0]
[{"$nulls":6},"","","","","","","",null,null,0]
[{"$nulls":6},"","","","","","","",null,null,0]
[{"$nulls":6},"","","","","","","",null,null,0]
[{"$nulls":6},"","","","","","","",null,null,0]
[{"$nulls":6},"","","","","","","",null,null,0]
[{"$nulls":6},"","","","","","","",null,null,0]
[{"$nulls":6},"","","","","","","",null,null,0]
[{"$nulls":6},"","","","","","","",null,null,0]
[{"$nulls":6},{"$f":"IF($E138=\"\",\"\",$E138+$G$9)","v":""},{"$f":"IF($E138=\"\",\"\",$E138+$H$9)","v":""},{"$f":"IF($E138=\"\",\"\",$E138+$I$9)","v":""},{"$f":"IF($E138=\"\",\"\",$E138+$J$9)","v":""},{"$f":"IF($E138=\"\",\"\",$E138+$K$9)","v":""},{"$f":"IF($E138=\"\",\"\",$E138+$L$9)","v":""},{"$f":"IF($E138=\"\",\"\",$E138+$M$9)","v":""},null,null,0]
[{"$nulls":6},"","","","","","","",null,null,0]
[{"$nulls":6},"","","","","","","",null,null,{"$f":"IFERROR(IF(G140=TODAY(),\"1\",IF(H140=TODAY(),\"1\",IF(I140=TODAY(),\"1\",IF(J140=TODAY(),\"1\",IF(K140=TODAY(),\"1\",IF(L140=TODAY(),\"1\",IF(M140=TODAY(),\"1\",))))))),\"\")","v":0}]
[{"$nulls":6},"","","","","","","",null,null,0]
[{"$nulls":6},"","","","","","","",null,null,0]
[{"$nulls":6},"","","","","","","",null,null,0]
[{"$nulls":6},"","","","","","","",null,null,0]
[{"$nulls":6},"","","","","","","",null,null,0]
[{"$nulls":6},"","","","","","","",null,null,0]
[{"$nulls":6},"","","","","","","",null,null,0]
[{"$nulls":6},"","","","","","","",null,null,0]
[{"$nulls":6},"","","","","","","",null,null,0]
[{"$nulls":6},"","","","","","","",null,null,0]
[{"$nulls":6},"","","","","","","",null,null,0]
[{"$nulls":6},"","","","","","","",null,null,0]
[{"$nulls":6},"","","","","","","",null,null,0]
[{"$nulls":6},"","","","","","","",null,null,0]
[{"$nulls":6},"","","","","","","",null,null,0]
[{"$nulls":6},"","","","","","","",null,null,0]
[{"$nulls":6},"","","","","","","",null,null,0]
[{"$nulls":6},"","","","","","","",null,null,0]
[{"$nulls":6},"","","","","","","",null,null,0]
[{"$nulls":6},"","","","","","","",null,null,0]
[{"$nulls":6},"","","","","","","",null,null,0]
[{"$nulls":6},"","","","","","","",null,null,0]
[{"$nulls":6},"","","","","","","",null,null,0]
[{"$nulls":6},"","","","","","","",null,null,0]
[{"$nulls":6},"","","","","","","",null,null,0]
[{"$nulls":6},"","","","","","","",null,null,0]
[{"$nulls":6},"","","","","","","",null,null,0]
[{"$nulls":6},"","","","","","","",null,null,0]
[{"$nulls":6},"","","","","","","",null,null,0]
[{"$nulls":6},"","","","","","","",null,null,0]
[{"$nulls":6},"","","","","","","",null,null,0]
[{"$nulls":6},"","","","","","","",null,null,0]
[{"$nulls":6},"","","","","","","",null,null,0]
[{"$nulls":6},"","","","","","","",null,null,0]
[{"$nulls":6},"","","","","","","",null,null,0]
[{"$nulls":6},"","","","","","","",null,null,0]
[{"$nulls":6},"","","","","","","",null,null,0]
[{"$nulls":6},"","","","","","","",null,null,0]
[{"$nulls":6},"","","","","","","",null,null,0]
[{"$nulls":6},"","","","","","","",null,null,0]
[{"$nulls":6},"","","","","","","",null,null,0]
[{"$nulls":6},"","","","","","","",null,null,0]
[{"$nulls":6},"","","","","","","",null,null,0]
[{"$nulls":6},"","","","","","","",null,null,0]
[{"$nulls":6},"","","","","","","",null,null,0]
[{"$nulls":6},"","","","","","","",null,null,0]
[{"$nulls":6},"","","","","","","",null,null,0]
[{"$nulls":6},"","","","","","","",null,null,0]
[{"$nulls":6},"","","","","","","",null,null,0]
[{"$nulls":6},"","","","","","","",null,null,0]
[{"$nulls":6},"","","","","","","",null,null,0]
[{"$nulls":6},"","","","","","","",null,null,0]
[{"$nulls":6},"","","","","","","",null,null,0]
[{"$nulls":6},"","","","","","","",null,null,0]
[{"$nulls":6},"","","","","","","",null,null,0]
[{"$nulls":6},"","","","","","","",null,null,0]
[{"$nulls":6},"","","","","","","",null,null,0]
[{"$nulls":6},"","","","","","","",null,null,0]
[{"$nulls":6},"","","","","","","",null,null,0]
[{"$nulls":6},"","","","","","","",null,null,0]
[{"$nulls":6},"","","","","","","",null,null,0]
[{"$nulls":6},{"$f":"IF($E202=\"\",\"\",$E202+$G$9)","v":""},{"$f":"IF($E202=\"\",\"\",$E202+$H$9)","v":""},{"$f":"IF($E202=\"\",\"\",$E202+$I$9)","v":""},{"$f":"IF($E202=\"\",\"\",$E202+$J$9)","v":""},{"$f":"IF($E202=\"\",\"\",$E202+$K$9)","v":""},{"$f":"IF($E202=\"\",\"\",$E202+$L$9)","v":""},{"$f":"IF($E202=\"\",\"\",$E202+$M$9)","v":""},null,null,0]
[{"$nulls":6},"","","","","","","",null,null,0]
[{"$nulls":6},"","","","","","","",null,null,{"$f":"IFERROR(IF(G204=TODAY(),\"1\",IF(H204=TODAY(),\"1\",IF(I204=TODAY(),\"1\",IF(J204=TODAY(),\"1\",IF(K204=TODAY(),\"1\",IF(L204=TODAY(),\"1\",IF(M204=TODAY(),\"1\",))))))),\"\")","v":0}]
[{"$nulls":6},"","","","","","","",null,null,0]
[{"$nulls":6},"","","","","","","",null,null,0]
[{"$nulls":6},"","","","","","","",null,null,0]
[{"$nulls":6},"","","","","","","",null,null,0]
[{"$nulls":6},"","","","","","","",null,null,0]
[{"$nulls":6},"","","","","","","",null,null,0]
[{"$nulls":6},"","","","","","","",null,null,0]
[{"$nulls":6},"","","","","","","",null,null,0]
[{"$nulls":6},"","","","","","","",null,null,0]
[{"$nulls":6},"","","","","","","",null,null,0]
[{"$nulls":6},"","","","","","","",null,null,0]
[{"$nulls":6},"","","","","","","",null,null,0]
[{"$nulls":6},"","","","","","","",null,null,0]
[{"$nulls":6},"","","","","","","",null,null,0]
[{"$nulls":6},"","","","","","","",null,null,0]
[{"$nulls":6},"","","","","","","",null,null,0]
[{"$nulls":6},"","","","","","","",null,null,0]
[{"$nulls":6},"","","","","","","",null,null,0]
[{"$nulls":6},"","","","","","","",null,null,0]
[{"$nulls":6},"","","","","","","",null,null,0]
[{"$nulls":6},"","","","","","","",null,null,0]
[{"$nulls":6},"","","","","","","",null,null,0]
[{"$nulls":6},"","","","","","","",null,null,0]
[{"$nulls":6},"","","","","","","",null,null,0]
[{"$nulls":6},"","","","","","","",null,null,0]
[{"$nulls":6},"","","","","","","",null,null,0]
[{"$nulls":6},"","","","","","","",null,null,0]
[{"$nulls":6},"","","","","","","",null,null,0]
[{"$nulls":6},"","","","","","","",null,null,0]
[{"$nulls":6},"","","","","","","",null,null,0]
[{"$nulls":6},"","","","","","","",null,null,0]
[{"$nulls":6},"","","","","","","",null,null,0]
[{"$nulls":6},"","","","","","","",null,null,0]
[{"$nulls":6},"","","","","","","",null,null,0]
[{"$nulls":6},"","","","","","","",null,null,0]
[{"$nulls":6},"","","","","","","",null,null,0]
[{"$nulls":6},"","","","","","","",null,null,0]
[{"$nulls":6},"","","","","","","",null,null,0]
[{"$nulls":6},"","","","","","","",null,null,0]
[{"$nulls":6},"","","","","","","",null,null,0]
[{"$nulls":6},"","","","","","","",null,null,0]
[{"$nulls":6},"","","","","","","",null,null,0]
[{"$nulls":6},"","","","","","","",null,null,0]
[{"$nulls":6},"","","","","","","",null,null,0]
[{"$nulls":6},"","","","","","","",null,null,0]
[{"$nulls":6},"","","","","","","",null,null,0]
[{"$nulls":6},"","","","","","","",null,null,0]
[{"$nulls":6},"","","","","","","",null,null,0]
[{"$nulls":6},"","","","","","","",null,null,0]
[{"$nulls":6},"","","","","","","",null,null,0]
[{"$nulls":6},"","","","","","","",null,null,0]
[{"$nulls":6},"","","","","","","",null,null,0]
[{"$nulls":6},"","","","","","","",null,null,0]
[{"$nulls":6},"","","","","","","",null,null,0]
[{"$nulls":6},"","","","","","","",null,null,0]

{"sheet":"2","index":20,"n_rows":259,"n_cols":16,"rows_kept":259,"merged":[[6,1,6,2],[6,6,6,12],[8,1,8,2]]}
[]
[]
[]
[{"$nulls":10},"Assuntos","Finalizado","Pendentes"]
[{"$nulls":10},{"$f":"COUNTA(O10:O259)","v":0},{"$f":"COUNTIF(O10:O259,\"Sim\")","v":0},{"$f":"K5-L5","v":0},null,{"$f":"L5/K5","v":{"$error":"#DIV/0!"}}]
[]
[null,{"$f":"Edital!C16","v":"RACIOCÍNIO LÓGICO MATEMÁTICO"},null,null,"Teoria",null,"Revisões",{"$nulls":7},"Teoria",{"$f":"COUNTIF($P$10:$P$259,\"<>0\")","v":0}]
[]
[null,"Assuntos",null,null,"Data estudo",null,1,7,15,30,60,90,140,null,"Finalizei o assunto?"]
[null,"Matéria",{"$nulls":4},{"$f":"IF($E10=\"\",\"\",$E10+$G$9)","v":""},{"$f":"IF($E10=\"\",\"\",$E10+$H$9)","v":""},{"$f":"IF($E10=\"\",\"\",$E10+$I$9)","v":""},{"$f":"IF($E10=\"\",\"\",$E10+$J$9)","v":""},{"$f":"IF($E10=\"\",\"\",$E10+$K$9)","v":""},{"$f":"IF($E10=\"\",\"\",$E10+$L$9)","v":""},{"$f":"IF($E10=\"\",\"\",$E10+$M$9)","v":""},null,null,{"$f":"IFERROR(IF(G10=TODAY(),\"1\",IF(H10=TODAY(),\"1\",IF(I10=TODAY(),\"1\",IF(J10=TODAY(),\"1\",IF(K10=TODAY(),\"1\",IF(L10=TODAY(),\"1\",IF(M10=TODAY(),\"1\",))))))),\"\")","v":0}]
[{"$nulls":6},"","","","","","","",null,null,{"$f":"IFERROR(IF(G11=TODAY(),\"1\",IF(H11=TODAY(),\"1\",IF(I11=TODAY(),\"1\",IF(J11=TODAY(),\"1\",IF(K11=TODAY(),\"1\",IF(L11=TODAY(),\"1\",IF(M11=TODAY(),\"1\",))))))),\"\")","v":0}]
[{"$nulls":6},"","","","","","","",null,null,{"$f":"IFERROR(IF(G12=TODAY(),\"1\",IF(H12=TODAY(),\"1\",IF(I12=TODAY(),\"1\",IF(J12=TODAY(),\"1\",IF(K12=TODAY(),\"1\",IF(L12=TODAY(),\"1\",IF(M12=TODAY(),\"1\",))))))),\"\")","v":0}]
[{"$nulls":6},"","","","","","","",null,null,0]
[{"$nulls":6},"","","","","","","",null,null,0]
[{"$nulls":6},"","","","","","","",null,null,0]
[{"$nulls":6},"","","","","","","",null,null,0]
[{"$nulls":6},"","","","","","","",null,null,0]
[{"$nulls":6},"","","","","","","",null,null,0]
[{"$nulls":6},"","","","","","","",null,null,0]
[{"$nulls":6},"","","","","","","",null,null,0]
[{"$nulls":6},"","","","","","","",null,null,0]
[{"$nulls":6},"","","","","","","",null,null,0]
[{"$nulls":6},"","","","","","","",null,null,0]
[{"$nulls":6},"","","","","","","",null,null,0]
[{"$nulls":6},"","","","","","","",null,null,0]
[{"$nulls":6},"","","","","","","",null,null,0]
[{"$nulls":6},"","","","","","","",null,null,0]
[{"$nulls":6},"","","","","","","",null,null,0]
[{"$nulls":6},"","","","","","","",null,null,0]
[{"$nulls":6},"","","","","","","",null,null,0]
[{"$nulls":6},"","","","","","","",null,null,0]
[{"$nulls":6},"","","","","","","",null,null,0]
[{"$nulls":6},"","","","","","","",null,null,0]
[{"$nulls":6},"","","","","","","",null,null,0]
[{"$nulls":6},"","","","","","","",null,null,0]
[{"$nulls":6},"","","","","","","",null,null,0]
[{"$nulls":6},"","","","","","","",null,null,0]
[{"$nulls":6},"","","","","","","",null,null,0]
[{"$nulls":6},"","","","","","","",null,null,0]
[{"$nulls":6},"","","","","","","",null,null,0]
[{"$nulls":6},"","","","","","","",null,null,0]
[{"$nulls":6},"","","","","","","",null,null,0]
[{"$nulls":6},"","","","","","","",null,null,0]
[{"$nulls":6},"","","","","","","",null,null,0]
[{"$nulls":6},"","","","","","","",null,null,0]
[{"$nulls":6},"","","","","","","",null,null,0]
[{"$nulls":6},"","","","","","","",null,null,0]
[{"$nulls":6},"","","","","","","",null,null,0]
[{"$nulls":6},"","","","","","","",null,null,0]
[{"$nulls":6},"","","","","","","",null,null,0]
[{"$nulls":6},"","","","","","","",null,null,0]
[{"$nulls":6},"","","","","","","",null,null,0]
[{"$nulls":6},"","","","","","","",null,null,0]
[{"$nulls":6},"","","","","","","",null,null,0]
[{"$nulls":6},"","","","","","","",null,null,0]
[{"$nulls":6},"","","","","","","",null,null,0]
[{"$nulls":6},"","","","","","","",null,null,0]
[{"$nulls":6},"","","","","","","",null,null,0]
[{"$nulls":6},"","","","","","","",null,null,0]
[{"$nulls":6},"","","","","","","",null,null,0]
[{"$nulls":6},"","","","","","","",null,null,0]
[{"$nulls":6},"","","","","","","",null,null,0]
[{"$nulls":6},"","","","","","","",null,null,0]
[{"$nulls":6},"","","","","","","",null,null,0]
[{"$nulls":6},"","","","","","","",null,null,0]
[{"$nulls":6},"","","","","","","",null,null,0]
[{"$nulls":6},"","","","","","","",null,null,0]
[{"$nulls":6},"","","","","","","",null,null,0]
[{"$nulls":6},"","","","","","","",null,null,0]
[{"$nulls":6},"","","","","","","",null,null,0]
[{"$nulls":6},"","","","","","","",null,null,0]
[{"$nulls":6},"","","","","","","",null,null,0]
[{"$nulls":6},"","","","","","","",null,null,0]
[{"$nulls":6},{"$f":"IF($E74=\"\",\"\",$E74+$G$9)","v":""},{"$f":"IF($E74=\"\",\"\",$E74+$H$9)","v":""},{"$f":"IF($E74=\"\",\"\",$E74+$I$9)","v":""},{"$f":"IF($E74=\"\",\"\",$E74+$J$9)","v":""},{"$f":"IF($E74=\"\",\"\",$E74+$K$9)","v":""},{"$f":"IF($E74=\"\",\"\",$E74+$L$9)","v":""},{"$f":"IF($E74=\"\",\"\",$E74+$M$9)","v":""},null,null,0]
[{"$nulls":6},"","","","","","","",null,null,0]
[{"$nulls":6},"","","","","","","",null,null,{"$f":"IFERROR(IF(G76=TODAY(),\"1\",IF(H76=TODAY(),\"1\",IF(I76=TODAY(),\"1\",IF(J76=TODAY(),\"1\",IF(K76=TODAY(),\"1\",IF(L76=TODAY(),\"1\",IF(M76=TODAY(),\"1\",))))))),\"\")","v":0}]
[{"$nulls":6},"","","","","","","",null,null,0]
[{"$nulls":6},"","","","","","","",null,null,0]
[{"$nulls":6},"","","","","","","",null,null,0]
[{"$nulls":6},"","","","","","","",null,null,0]
[{"$nulls":6},"","","","","","","",null,null,0]
[{"$nulls":6},"","","","","","","",null,null,0]
[{"$nulls":6},"","","","","","","",null,null,0]
[{"$nulls":6},"","","","","","","",null,null,0]
[{"$nulls":6},"","","","","","","",null,null,0]
[{"$nulls":6},"","","","","","","",null,null,0]
[{"$nulls":6},"","","","","","","",null,null,0]
[{"$nulls":6},"","","","","","","",null,null,0]
[{"$nulls":6},"","","","","","","",null,null,0]
[{"$nulls":6},"","","","","","","",null,null,0]
[{"$nulls":6},"","","","","","","",null,null,0]
[{"$nulls":6},"","","","","","","",null,null,0]
[{"$nulls":6},"","","","","","","",null,null,0]
[{"$nulls":6},"","","","","","","",null,null,0]
[{"$nulls":6},"","","","","","","",null,null,0]
[{"$nulls":6},"","","","","","","",null,null,0]
[{"$nulls":6},"","","","","","","",null,null,0]
[{"$nulls":6},"","","","","","","",null,null,0]
[{"$nulls":6},"","","","","","","",null,null,0]
[{"$nulls":6},"","","","","","","",null,null,0]
[{"$nulls":6},"","","","","","","",null,null,0]
[{"$nulls":6},"","","","","","","",null,null,0]
[{"$nulls":6},"","","","","","","",null,null,0]
[{"$nulls":6},"","","","","","","",null,null,0]
[{"$nulls":6},"","","","","","","",null,null,0]
[{"$nulls":6},"","","","","","","",null,null,0]
[{"$nulls":6},"","","","","","","",null,null,0]
[{"$nulls":6},"","","","","","","",null,null,0]
[{"$nulls":6},"","","","","","","",null,null,0]
[{"$nulls":6},"","","","","","","",null,null,0]
[{"$nulls":6},"","","","","","","",null,null,0]
[{"$nulls":6},"","","","","","","",null,null,0]
[{"$nulls":6},"","","","","","","",null,null,0]
[{"$nulls":6},"","","","","","","",null,null,0]
[{"$nulls":6},"","","","","","","",null,null,0]
[{"$nulls":6},"","","","","","","",null,null,0]
[{"$nulls":6},"","","","","","","",null,null,0]
[{"$nulls":6},"","","","","","","",null,null,0]
[{"$nulls":6},"","","","","","","",null,null,0]
[{"$nulls":6},"","","","","","","",null,null,0]
[{"$nulls":6},"","","","","","","",null,null,0]
[{"$nulls":6},"","","","","","","",null,null,0]
[{"$nulls":6},"","","","","","","",null,null,0]
[{"$nulls":6},"","","","","","","",null,null,0]
[{"$nulls":6},"","","","","","","",null,null,0]
[{"$nulls":6},"","","","","","","",null,null,0]
[{"$nulls":6},"","","","","","","",null,null,0]
[{"$nulls":6},"","","","","","","",null,null,0]
[{"$nulls":6},"","","","","","","",null,null,0]
[{"$nulls":6},"","","","","","","",null,null,0]
[{"$nulls":6},"","","","","","","",null,null,0]
[{"$nulls":6},"","","","","","","",null,null,0]
[{"$nulls":6},"","","","","","","",null,null,0]
[{"$nulls":6},"","","","","","","",null,null,0]
[{"$nulls":6},"","","","","","","",null,null,0]
[{"$nulls":6},"","","","","","","",null,null,0]
[{"$nulls":6},"","","","","","","",null,null,0]
[{"$nulls":6},{"$f":"IF($E138=\"\",\"\",$E138+$G$9)","v":""},{"$f":"IF($E138=\"\",\"\",$E138+$H$9)","v":""},{"$f":"IF($E138=\"\",\"\",$E138+$I$9)","v":""},{"$f":"IF($E138=\"\",\"\",$E138+$J$9)","v":""},{"$f":"IF($E138=\"\",\"\",$E138+$K$9)","v":""},{"$f":"IF($E138=\"\",\"\",$E138+$L$9)","v":""},{"$f":"IF($E138=\"\",\"\",$E138+$M$9)","v":""},null,null,0]
[{"$nulls":6},"","","","","","","",null,null,0]
[{"$nulls":6},"","","","","","","",null,null,{"$f":"IFERROR(IF(G140=TODAY(),\"1\",IF(H140=TODAY(),\"1\",IF(I140=TODAY(),\"1\",IF(J140=TODAY(),\"1\",IF(K140=TODAY(),\"1\",IF(L140=TODAY(),\"1\",IF(M140=TODAY(),\"1\",))))))),\"\")","v":0}]
[{"$nulls":6},"","","","","","","",null,null,0]
[{"$nulls":6},"","","","","","","",null,null,0]
[{"$nulls":6},"","","","","","","",null,null,0]
[{"$nulls":6},"","","","","","","",null,null,0]
[{"$nulls":6},"","","","","","","",null,null,0]
[{"$nulls":6},"","","","","","","",null,null,0]
[{"$nulls":6},"","","","","","","",null,null,0]
[{"$nulls":6},"","","","","","","",null,null,0]
[{"$nulls":6},"","","","","","","",null,null,0]
[{"$nulls":6},"","","","","","","",null,null,0]
[{"$nulls":6},"","","","","","","",null,null,0]
[{"$nulls":6},"","","","","","","",null,null,0]
[{"$nulls":6},"","","","","","","",null,null,0]
[{"$nulls":6},"","","","","","","",null,null,0]
[{"$nulls":6},"","","","","","","",null,null,0]
[{"$nulls":6},"","","","","","","",null,null,0]
[{"$nulls":6},"","","","","","","",null,null,0]
[{"$nulls":6},"","","","","","","",null,null,0]
[{"$nulls":6},"","","","","","","",null,null,0]
[{"$nulls":6},"","","","","","","",null,null,0]
[{"$nulls":6},"","","","","","","",null,null,0]
[{"$nulls":6},"","","","","","","",null,null,0]
[{"$nulls":6},"","","","","","","",null,null,0]
[{"$nulls":6},"","","","","","","",null,null,0]
[{"$nulls":6},"","","","","","","",null,null,0]
[{"$nulls":6},"","","","","","","",null,null,0]
[{"$nulls":6},"","","","","","","",null,null,0]
[{"$nulls":6},"","","","","","","",null,null,0]
[{"$nulls":6},"","","","","","","",null,null,0]
[{"$nulls":6},"","","","","","","",null,null,0]
[{"$nulls":6},"","","","","","","",null,null,0]
[{"$nulls":6},"","","","","","","",null,null,0]
[{"$nulls":6},"","","","","","","",null,null,0]
[{"$nulls":6},"","","","","","","",null,null,0]
[{"$nulls":6},"","","","","","","",null,null,0]
[{"$nulls":6},"","","","","","","",null,null,0]
[{"$nulls":6},"","","","","","","",null,null,0]
[{"$nulls":6},"","","","","","","",null,null,0]
[{"$nulls":6},"","","","","","","",null,null,0]
[{"$nulls":6},"","","","","","","",null,null,0]
[{"$nulls":6},"","","","","","","",null,null,0]
[{"$nulls":6},"","","","","","","",null,null,0]
[{"$nulls":6},"","","","","","","",null,null,0]
[{"$nulls":6},"","","","","","","",null,null,0]
[{"$nulls":6},"","","","","","","",null,null,0]
[{"$nulls":6},"","","","","","","",null,null,0]
[{"$nulls":6},"","","","","","","",null,null,0]
[{"$nulls":6},"","","","","","","",null,null,0]
[{"$nulls":6},"","","","","","","",null,null,0]
[{"$nulls":6},"","","","","","","",null,null,0]
[{"$nulls":6},"","","","","","","",null,null,0]
[{"$nulls":6},"","","","","","","",null,null,0]
[{"$nulls":6},"","","","","","","",null,null,0]
[{"$nulls":6},"","","","","","","",null,null,0]
[{"$nulls":6},"","","","","","","",null,null,0]
[{"$nulls":6},"","","","","","","",null,null,0]
[{"$nulls":6},"","","","","","","",null,null,0]
[{"$nulls":6},"","","","","","","",null,null,0]
[{"$nulls":6},"","","","","","","",null,null,0]
[{"$nulls":6},"","","","","","","",null,null,0]
[{"$nulls":6},"","","","","","","",null,null,0]
[{"$nulls":6},{"$f":"IF($E202=\"\",\"\",$E202+$G$9)","v":""},{"$f":"IF($E202=\"\",\"\",$E202+$H$9)","v":""},{"$f":"IF($E202=\"\",\"\",$E202+$I$9)","v":""},{"$f":"IF($E202=\"\",\"\",$E202+$J$9)","v":""},{"$f":"IF($E202=\"\",\"\",$E202+$K$9)","v":""},{"$f":"IF($E202=\"\",\"\",$E202+$L$9)","v":""},{"$f":"IF($E202=\"\",\"\",$E202+$M$9)","v":""},null,null,0]
[{"$nulls":6},"","","","","","","",null,null,0]
[{"$nulls":6},"","","","","","","",null,null,{"$f":"IFERROR(IF(G204=TODAY(),\"1\",IF(H204=TODAY(),\"1\",IF(I204=TODAY(),\"1\",IF(J204=TODAY(),\"1\",IF(K204=TODAY(),\"1\",IF(L204=TODAY(),\"1\",IF(M204=TODAY(),\"1\",))))))),\"\")","v":0}]
[{"$nulls":6},"","","","","","","",null,null,0]
[{"$nulls":6},"","","","","","","",null,null,0]
[{"$nulls":6},"","","","","","","",null,null,0]
[{"$nulls":6},"","","","","","","",null,null,0]
[{"$nulls":6},"","","","","","","",null,null,0]
[{"$nulls":6},"","","","","","","",null,null,0]
[{"$nulls":6},"","","","","","","",null,null,0]
[{"$nulls":6},"","","","","","","",null,null,0]
[{"$nulls":6},"","","","","","","",null,null,0]
[{"$nulls":6},"","","","","","","",null,null,0]
[{"$nulls":6},"","","","","","","",null,null,0]
[{"$nulls":6},"","","","","","","",null,null,0]
[{"$nulls":6},"","","","","","","",null,null,0]
[{"$nulls":6},"","","","","","","",null,null,0]
[{"$nulls":6},"","","","","","","",null,null,0]
[{"$nulls":6},"","","","","","","",null,null,0]
[{"$nulls":6},"","","","","","","",null,null,0]
[{"$nulls":6},"","","","","","","",null,null,0]
[{"$nulls":6},"","","","","","","",null,null,0]
[{"$nulls":6},"","","","","","","",null,null,0]
[{"$nulls":6},"","","","","","","",null,null,0]
[{"$nulls":6},"","","","","","","",null,null,0]
[{"$nulls":6},"","","","","","","",null,null,0]
[{"$nulls":6},"","","","","","","",null,null,0]
[{"$nulls":6},"","","","","","","",null,null,0]
[{"$nulls":6},"","","","","","","",null,null,0]
[{"$nulls":6},"","","","","","","",null,null,0]
[{"$nulls":6},"","","","","","","",null,null,0]
[{"$nulls":6},"","","","","","","",null,null,0]
[{"$nulls":6},"","","","","","","",null,null,0]
[{"$nulls":6},"","","","","","","",null,null,0]
[{"$nulls":6},"","","","","","","",null,null,0]
[{"$nulls":6},"","","","","","","",null,null,0]
[{"$nulls":6},"","","","","","","",null,null,0]
[{"$nulls":6},"","","","","","","",null,null,0]
[{"$nulls":6},"","","","","","","",null,null,0]
[{"$nulls":6},"","","","","","","",null,null,0]
[{"$nulls":6},"","","","","","","",null,null,0]
[{"$nulls":6},"","","","","","","",null,null,0]
[{"$nulls":6},"","","","","","","",null,null,0]
[{"$nulls":6},"","","","","","","",null,null,0]
[{"$nulls":6},"","","","","","","",null,null,0]
[{"$nulls":6},"","","","","","","",null,null,0]
[{"$nulls":6},"","","","","","","",null,null,0]
[{"$nulls":6},"","","","","","","",null,null,0]
[{"$nulls":6},"","","","","","","",null,null,0]
[{"$nulls":6},"","","","","","","",null,null,0]
[{"$nulls":6},"","","","","","","",null,null,0]
[{"$nulls":6},"","","","","","","",null,null,0]
[{"$nulls":6},"","","","","","","",null,null,0]
[{"$nulls":6},"","","","","","","",null,null,0]
[{"$nulls":6},"","","","","","","",null,null,0]
[{"$nulls":6},"","","","","","","",null,null,0]
[{"$nulls":6},"","","","","","","",null,null,0]
[{"$nulls":6},"","","","","","","",null,null,0]

{"sheet":"3","index":21,"n_rows":259,"n_cols":16,"rows_kept":259,"merged":[[6,1,6,2],[6,6,6,12],[8,1,8,2]]}
[]
[]
[]
[{"$nulls":10},"Assuntos","Finalizado","Pendentes"]
[{"$nulls":10},{"$f":"COUNTA(O10:O259)","v":0},{"$f":"COUNTIF(O10:O259,\"Sim\")","v":0},{"$f":"K5-L5","v":0},null,{"$f":"L5/K5","v":{"$error":"#DIV/0!"}}]
[]
[null,{"$f":"Edital!C17","v":"INFORMÁTICA"},null,null,"Teoria",null,"Revisões",{"$nulls":7},"Teoria",{"$f":"COUNTIF($P$10:$P$259,\"<>0\")","v":0}]
[]
[null,"Assuntos",null,null,"Data estudo",null,1,7,15,30,60,90,140,null,"Finalizei o assunto?"]
[null,"Matéria",{"$nulls":4},{"$f":"IF($E10=\"\",\"\",$E10+$G$9)","v":""},{"$f":"IF($E10=\"\",\"\",$E10+$H$9)","v":""},{"$f":"IF($E10=\"\",\"\",$E10+$I$9)","v":""},{"$f":"IF($E10=\"\",\"\",$E10+$J$9)","v":""},{"$f":"IF($E10=\"\",\"\",$E10+$K$9)","v":""},{"$f":"IF($E10=\"\",\"\",$E10+$L$9)","v":""},{"$f":"IF($E10=\"\",\"\",$E10+$M$9)","v":""},null,null,{"$f":"IFERROR(IF(G10=TODAY(),\"1\",IF(H10=TODAY(),\"1\",IF(I10=TODAY(),\"1\",IF(J10=TODAY(),\"1\",IF(K10=TODAY(),\"1\",IF(L10=TODAY(),\"1\",IF(M10=TODAY(),\"1\",))))))),\"\")","v":0}]
[{"$nulls":6},"","","","","","","",null,null,{"$f":"IFERROR(IF(G11=TODAY(),\"1\",IF(H11=TODAY(),\"1\",IF(I11=TODAY(),\"1\",IF(J11=TODAY(),\"1\",IF(K11=TODAY(),\"1\",IF(L11=TODAY(),\"1\",IF(M11=TODAY(),\"1\",))))))),\"\")","v":0}]
[{"$nulls":6},"","","","","","","",null,null,{"$f":"IFERROR(IF(G12=TODAY(),\"1\",IF(H12=TODAY(),\"1\",IF(I12=TODAY(),\"1\",IF(J12=TODAY(),\"1\",IF(K12=TODAY(),\"1\",IF(L12=TODAY(),\"1\",IF(M12=TODAY(),\"1\",))))))),\"\")","v":0}]
[{"$nulls":6},"","","","","","","",null,null,0]
[{"$nulls":6},"","","","","","","",null,null,0]
[{"$nulls":6},"","","","","","","",null,null,0]
[{"$nulls":6},"","","","","","","",null,null,0]
[{"$nulls":6},"","","","","","","",null,null,0]
[{"$nulls":6},"","","","","","","",null,null,0]
[{"$nulls":6},"","","","","","","",null,null,0]
[{"$nulls":6},"","","","","","","",null,null,0]
[{"$nulls":6},"","","","","","","",null,null,0]
[{"$nulls":6},"","","","","","","",null,null,0]
[{"$nulls":6},"","","","","","","",null,null,0]
[{"$nulls":6},"","","","","","","",null,null,0]
[{"$nulls":6},"","","","","","","",null,null,0]
[{"$nulls":6},"","","","","","","",null,null,0]
[{"$nulls":6},"","","","","","","",null,null,0]
[{"$nulls":6},"","","","","","","",null,null,0]
[{"$nulls":6},"","","","","","","",null,null,0]
[{"$nulls":6},"","","","","","","",null,null,0]
[{"$nulls":6},"","","","","","","",null,null,0]
[{"$nulls":6},"","","","","","","",null,null,0]
[{"$nulls":6},"","","","","","","",null,null,0]
[{"$nulls":6},"","","","","","","",null,null,0]
[{"$nulls":6},"","","","","","","",null,null,0]
[{"$nulls":6},"","","","","","","",null,null,0]
[{"$nulls":6},"","","","","","","",null,null,0]
[{"$nulls":6},"","","","","","","",null,null,0]
[{"$nulls":6},"","","","","","","",null,null,0]
[{"$nulls":6},"","","","","","","",null,null,0]
[{"$nulls":6},"","","","","","","",null,null,0]
[{"$nulls":6},"","","","","","","",null,null,0]
[{"$nulls":6},"","","","","","","",null,null,0]
[{"$nulls":6},"","","","","","","",null,null,0]
[{"$nulls":6},"","","","","","","",null,null,0]
[{"$nulls":6},"","","","","","","",null,null,0]
[{"$nulls":6},"","","","","","","",null,null,0]
[{"$nulls":6},"","","","","","","",null,null,0]
[{"$nulls":6},"","","","","","","",null,null,0]
[{"$nulls":6},"","","","","","","",null,null,0]
[{"$nulls":6},"","","","","","","",null,null,0]
[{"$nulls":6},"","","","","","","",null,null,0]
[{"$nulls":6},"","","","","","","",null,null,0]
[{"$nulls":6},"","","","","","","",null,null,0]
[{"$nulls":6},"","","","","","","",null,null,0]
[{"$nulls":6},"","","","","","","",null,null,0]
[{"$nulls":6},"","","","","","","",null,null,0]
[{"$nulls":6},"","","","","","","",null,null,0]
[{"$nulls":6},"","","","","","","",null,null,0]
[{"$nulls":6},"","","","","","","",null,null,0]
[{"$nulls":6},"","","","","","","",null,null,0]
[{"$nulls":6},"","","","","","","",null,null,0]
[{"$nulls":6},"","","","","","","",null,null,0]
[{"$nulls":6},"","","","","","","",null,null,0]
[{"$nulls":6},"","","","","","","",null,null,0]
[{"$nulls":6},"","","","","","","",null,null,0]
[{"$nulls":6},"","","","","","","",null,null,0]
[{"$nulls":6},"","","","","","","",null,null,0]
[{"$nulls":6},"","","","","","","",null,null,0]
[{"$nulls":6},"","","","","","","",null,null,0]
[{"$nulls":6},"","","","","","","",null,null,0]
[{"$nulls":6},"","","","","","","",null,null,0]
[{"$nulls":6},"","","","","","","",null,null,0]
[{"$nulls":6},{"$f":"IF($E74=\"\",\"\",$E74+$G$9)","v":""},{"$f":"IF($E74=\"\",\"\",$E74+$H$9)","v":""},{"$f":"IF($E74=\"\",\"\",$E74+$I$9)","v":""},{"$f":"IF($E74=\"\",\"\",$E74+$J$9)","v":""},{"$f":"IF($E74=\"\",\"\",$E74+$K$9)","v":""},{"$f":"IF($E74=\"\",\"\",$E74+$L$9)","v":""},{"$f":"IF($E74=\"\",\"\",$E74+$M$9)","v":""},null,null,0]
[{"$nulls":6},"","","","","","","",null,null,0]
[{"$nulls":6},"","","","","","","",null,null,{"$f":"IFERROR(IF(G76=TODAY(),\"1\",IF(H76=TODAY(),\"1\",IF(I76=TODAY(),\"1\",IF(J76=TODAY(),\"1\",IF(K76=TODAY(),\"1\",IF(L76=TODAY(),\"1\",IF(M76=TODAY(),\"1\",))))))),\"\")","v":0}]
[{"$nulls":6},"","","","","","","",null,null,0]
[{"$nulls":6},"","","","","","","",null,null,0]
[{"$nulls":6},"","","","","","","",null,null,0]
[{"$nulls":6},"","","","","","","",null,null,0]
[{"$nulls":6},"","","","","","","",null,null,0]
[{"$nulls":6},"","","","","","","",null,null,0]
[{"$nulls":6},"","","","","","","",null,null,0]
[{"$nulls":6},"","","","","","","",null,null,0]
[{"$nulls":6},"","","","","","","",null,null,0]
[{"$nulls":6},"","","","","","","",null,null,0]
[{"$nulls":6},"","","","","","","",null,null,0]
[{"$nulls":6},"","","","","","","",null,null,0]
[{"$nulls":6},"","","","","","","",null,null,0]
[{"$nulls":6},"","","","","","","",null,null,0]
[{"$nulls":6},"","","","","","","",null,null,0]
[{"$nulls":6},"","","","","","","",null,null,0]
[{"$nulls":6},"","","","","","","",null,null,0]
[{"$nulls":6},"","","","","","","",null,null,0]
[{"$nulls":6},"","","","","","","",null,null,0]
[{"$nulls":6},"","","","","","","",null,null,0]
[{"$nulls":6},"","","","","","","",null,null,0]
[{"$nulls":6},"","","","","","","",null,null,0]
[{"$nulls":6},"","","","","","","",null,null,0]
[{"$nulls":6},"","","","","","","",null,null,0]
[{"$nulls":6},"","","","","","","",null,null,0]
[{"$nulls":6},"","","","","","","",null,null,0]
[{"$nulls":6},"","","","","","","",null,null,0]
[{"$nulls":6},"","","","","","","",null,null,0]
[{"$nulls":6},"","","","","","","",null,null,0]
[{"$nulls":6},"","","","","","","",null,null,0]
[{"$nulls":6},"","","","","","","",null,null,0]
[{"$nulls":6},"","","","","","","",null,null,0]
[{"$nulls":6},"","","","","","","",null,null,0]
[{"$nulls":6},"","","","","","","",null,null,0]
[{"$nulls":6},"","","","","","","",null,null,0]
[{"$nulls":6},"","","","","","","",null,null,0]
[{"$nulls":6},"","","","","","","",null,null,0]
[{"$nulls":6},"","","","","","","",null,null,0]
[{"$nulls":6},"","","","","","","",null,null,0]
[{"$nulls":6},"","","","","","","",null,null,0]
[{"$nulls":6},"","","","","","","",null,null,0]
[{"$nulls":6},"","","","","","","",null,null,0]
[{"$nulls":6},"","","","","","","",null,null,0]
[{"$nulls":6},"","","","","","","",null,null,0]
[{"$nulls":6},"","","","","","","",null,null,0]
[{"$nulls":6},"","","","","","","",null,null,0]
[{"$nulls":6},"","","","","","","",null,null,0]
[{"$nulls":6},"","","","","","","",null,null,0]
[{"$nulls":6},"","","","","","","",null,null,0]
[{"$nulls":6},"","","","","","","",null,null,0]
[{"$nulls":6},"","","","","","","",null,null,0]
[{"$nulls":6},"","","","","","","",null,null,0]
[{"$nulls":6},"","","","","","","",null,null,0]
[{"$nulls":6},"","","","","","","",null,null,0]
[{"$nulls":6},"","","","","","","",null,null,0]
[{"$nulls":6},"","","","","","","",null,null,0]
[{"$nulls":6},"","","","","","","",null,null,0]
[{"$nulls":6},"","","","","","","",null,null,0]
[{"$nulls":6},"","","","","","","",null,null,0]
[{"$nulls":6},"","","","","","","",null,null,0]
[{"$nulls":6},"","","","","","","",null,null,0]
[{"$nulls":6},{"$f":"IF($E138=\"\",\"\",$E138+$G$9)","v":""},{"$f":"IF($E138=\"\",\"\",$E138+$H$9)","v":""},{"$f":"IF($E138=\"\",\"\",$E138+$I$9)","v":""},{"$f":"IF($E138=\"\",\"\",$E138+$J$9)","v":""},{"$f":"IF($E138=\"\",\"\",$E138+$K$9)","v":""},{"$f":"IF($E138=\"\",\"\",$E138+$L$9)","v":""},{"$f":"IF($E138=\"\",\"\",$E138+$M$9)","v":""},null,null,0]
[{"$nulls":6},"","","","","","","",null,null,0]
[{"$nulls":6},"","","","","","","",null,null,{"$f":"IFERROR(IF(G140=TODAY(),\"1\",IF(H140=TODAY(),\"1\",IF(I140=TODAY(),\"1\",IF(J140=TODAY(),\"1\",IF(K140=TODAY(),\"1\",IF(L140=TODAY(),\"1\",IF(M140=TODAY(),\"1\",))))))),\"\")","v":0}]
[{"$nulls":6},"","","","","","","",null,null,0]
[{"$nulls":6},"","","","","","","",null,null,0]
[{"$nulls":6},"","","","","","","",null,null,0]
[{"$nulls":6},"","","","","","","",null,null,0]
[{"$nulls":6},"","","","","","","",null,null,0]
[{"$nulls":6},"","","","","","","",null,null,0]
[{"$nulls":6},"","","","","","","",null,null,0]
[{"$nulls":6},"","","","","","","",null,null,0]
[{"$nulls":6},"","","","","","","",null,null,0]
[{"$nulls":6},"","","","","","","",null,null,0]
[{"$nulls":6},"","","","","","","",null,null,0]
[{"$nulls":6},"","","","","","","",null,null,0]
[{"$nulls":6},"","","","","","","",null,null,0]
[{"$nulls":6},"","","","","","","",null,null,0]
[{"$nulls":6},"","","","","","","",null,null,0]
[{"$nulls":6},"","","","","","","",null,null,0]
[{"$nulls":6},"","","","","","","",null,null,0]
[{"$nulls":6},"","","","","","","",null,null,0]
[{"$nulls":6},"","","","","","","",null,null,0]
[{"$nulls":6},"","","","","","","",null,null,0]
[{"$nulls":6},"","","","","","","",null,null,0]
[{"$nulls":6},"","","","","","","",null,null,0]
[{"$nulls":6},"","","","","","","",null,null,0]
[{"$nulls":6},"","","","","","","",null,null,0]
[{"$nulls":6},"","","","","","","",null,null,0]
[{"$nulls":6},"","","","","","","",null,null,0]
[{"$nulls":6},"","","","","","","",null,null,0]
[{"$nulls":6},"","","","","","","",null,null,0]
[{"$nulls":6},"","","","","","","",null,null,0]
[{"$nulls":6},"","","","","","","",null,null,0]
[{"$nulls":6},"","","","","","","",null,null,0]
[{"$nulls":6},"","","","","","","",null,null,0]
[{"$nulls":6},"","","","","","","",null,null,0]
[{"$nulls":6},"","","","","","","",null,null,0]
[{"$nulls":6},"","","","","","","",null,null,0]
[{"$nulls":6},"","","","","","","",null,null,0]
[{"$nulls":6},"","","","","","","",null,null,0]
[{"$nulls":6},"","","","","","","",null,null,0]
[{"$nulls":6},"","","","","","","",null,null,0]
[{"$nulls":6},"","","","","","","",null,null,0]
[{"$nulls":6},"","","","","","","",null,null,0]
[{"$nulls":6},"","","","","","","",null,null,0]
[{"$nulls":6},"","","","","","","",null,null,0]
[{"$nulls":6},"","","","","","","",null,null,0]
[{"$nulls":6},"","","","","","","",null,null,0]
[{"$nulls":6},"","","","","","","",null,null,0]
[{"$nulls":6},"","","","","","","",null,null,0]
[{"$nulls":6},"","","","","","","",null,null,0]
[{"$nulls":6},"","","","","","","",null,null,0]
[{"$nulls":6},"","","","","","","",null,null,0]
[{"$nulls":6},"","","","","","","",null,null,0]
[{"$nulls":6},"","","","","","","",null,null,0]
[{"$nulls":6},"","","","","","","",null,null,0]
[{"$nulls":6},"","","","","","","",null,null,0]
[{"$nulls":6},"","","","","","","",null,null,0]
[{"$nulls":6},"","","","","","","",null,null,0]
[{"$nulls":6},"","","","","","","",null,null,0]
[{"$nulls":6},"","","","","","","",null,null,0]
[{"$nulls":6},"","","","","","","",null,null,0]
[{"$nulls":6},"","","","","","","",null,null,0]
[{"$nulls":6},"","","","","","","",null,null,0]
[{"$nulls":6},{"$f":"IF($E202=\"\",\"\",$E202+$G$9)","v":""},{"$f":"IF($E202=\"\",\"\",$E202+$H$9)","v":""},{"$f":"IF($E202=\"\",\"\",$E202+$I$9)","v":""},{"$f":"IF($E202=\"\",\"\",$E202+$J$9)","v":""},{"$f":"IF($E202=\"\",\"\",$E202+$K$9)","v":""},{"$f":"IF($E202=\"\",\"\",$E202+$L$9)","v":""},{"$f":"IF($E202=\"\",\"\",$E202+$M$9)","v":""},null,null,0]
[{"$nulls":6},"","","","","","","",null,null,0]
[{"$nulls":6},"","","","","","","",null,null,{"$f":"IFERROR(IF(G204=TODAY(),\"1\",IF(H204=TODAY(),\"1\",IF(I204=TODAY(),\"1\",IF(J204=TODAY(),\"1\",IF(K204=TODAY(),\"1\",IF(L204=TODAY(),\"1\",IF(M204=TODAY(),\"1\",))))))),\"\")","v":0}]
[{"$nulls":6},"","","","","","","",null,null,0]
[{"$nulls":6},"","","","","","","",null,null,0]
[{"$nulls":6},"","","","","","","",null,null,0]
[{"$nulls":6},"","","","","","","",null,null,0]
[{"$nulls":6},"","","","","","","",null,null,0]
[{"$nulls":6},"","","","","","","",null,null,0]
[{"$nulls":6},"","","","","","","",null,null,0]
[{"$nulls":6},"","","","","","","",null,null,0]
[{"$nulls":6},"","","","","","","",null,null,0]
[{"$nulls":6},"","","","","","","",null,null,0]
[{"$nulls":6},"","","","","","","",null,null,0]
[{"$nulls":6},"","","","","","","",null,null,0]
[{"$nulls":6},"","","","","","","",null,null,0]
[{"$nulls":6},"","","","","","","",null,null,0]
[{"$nulls":6},"","","","","","","",null,null,0]
[{"$nulls":6},"","","","","","","",null,null,0]
[{"$nulls":6},"","","","","","","",null,null,0]
[{"$nulls":6},"","","","","","","",null,null,0]
[{"$nulls":6},"","","","","","","",null,null,0]
[{"$nulls":6},"","","","","","","",null,null,0]
[{"$nulls":6},"","","","","","","",null,null,0]
[{"$nulls":6},"","","","","","","",null,null,0]
[{"$nulls":6},"","","","","","","",null,null,0]
[{"$nulls":6},"","","","","","","",null,null,0]
[{"$nulls":6},"","","","","","","",null,null,0]
[{"$nulls":6},"","","","","","","",null,null,0]
[{"$nulls":6},"","","","","","","",null,null,0]
[{"$nulls":6},"","","","","","","",null,null,0]
[{"$nulls":6},"","","","","","","",null,null,0]
[{"$nulls":6},"","","","","","","",null,null,0]
[{"$nulls":6},"","","","","","","",null,null,0]
[{"$nulls":6},"","","","","","","",null,null,0]
[{"$nulls":6},"","","","","","","",null,null,0]
[{"$nulls":6},"","","","","","","",null,null,0]
[{"$nulls":6},"","","","","","","",null,null,0]
[{"$nulls":6},"","","","","","","",null,null,0]
[{"$nulls":6},"","","","","","","",null,null,0]
[{"$nulls":6},"","","","","","","",null,null,0]
[{"$nulls":6},"","","","","","","",null,null,0]
[{"$nulls":6},"","","","","","","",null,null,0]
[{"$nulls":6},"","","","","","","",null,null,0]
[{"$nulls":6},"","","","","","","",null,null,0]
[{"$nulls":6},"","","","","","","",null,null,0]
[{"$nulls":6},"","","","","","","",null,null,0]
[{"$nulls":6},"","","","","","","",null,null,0]
[{"$nulls":6},"","","","","","","",null,null,0]
[{"$nulls":6},"","","","","","","",null,null,0]
[{"$nulls":6},"","","","","","","",null,null,0]
[{"$nulls":6},"","","","","","","",null,null,0]
[{"$nulls":6},"","","","","","","",null,null,0]
[{"$nulls":6},"","","","","","","",null,null,0]
[{"$nulls":6},"","","","","","","",null,null,0]
[{"$nulls":6},"","","","","","","",null,null,0]
[{"$nulls":6},"","","","","","","",null,null,0]
[{"$nulls":6},"","","","","","","",null,null,0]